{"text_format":"1","workbook":"xlsx","n_sheets":5,"sheets":["Comparison","data","Lists","AHRI Ratings","AHRI Part Load Ratings"],"not_rendered":{"charts":8,"images":1,"macros":1,"external_links":1,"defined_names":26,"comments":0,"pivot_tables":0},"unopened":[],"bounds":{"document_bytes":16777216,"sheet_cells":100000,"rows_first":2000,"rows_last":500,"rows_between":2000,"halvings":0,"cell_chars":16384,"cell_head_chars":4096},"cells_cut":0,"cells_raw":0,"read":"whole","date_system":"1900"}

{"sheet":"Comparison","index":0,"n_rows":88,"n_cols":12,"rows_kept":88,"cut":false,"hidden":false,"merged":[[74,5,74,7],[76,5,76,7],[78,5,78,7],[74,9,74,11],[76,9,76,11],[78,9,78,11],[72,5,72,7],[12,4,12,5],[26,1,26,3],[26,4,26,6],[72,9,72,11],[52,4,52,6],[60,4,60,6],[34,4,34,6],[74,0,74,3],[76,0,76,3],[78,0,78,3],[8,0,8,1],[10,0,10,1],[70,1,70,3],[10,2,10,3],[72,0,72,3],[52,1,52,3],[60,1,60,3],[34,1,34,3]]}
[]
[]
[]
[]
[]
[]
["Building Location",null,null,null,null,null,null,"Loop Information",null,null,"Unit Cost"]
[]
["Select State",null,"Maryland",null,"Select Country","USA",null,"25% Methanol"," Fluid",null,null,{"$f":"IF(C21=\"\",\"\",C21&\" Price\")","v":"Whalen Price"}]
[]
["Select Location",null,"Baltimore - Washngtn Int'l Airport",null,null,null,null,70," Loop Temp (F)",null,null,1979]
[]
[null,null,null,{"$f":"IF(C11=\"\",\"Enter location\",\"Your selected location reports a commercial electric cost of $\")","v":"Your selected location reports a commercial electric cost of $"},{"$f":"IF(C11=\"\",\"\",ROUND(VLOOKUP(C11&\", \"&C9,data!$D$2:$Q$993,9,FALSE),3))","v":0.104},null,null,75," System Head (Ft)",null,null,{"$f":"IF(C47=\"\",\"\",C47&\" Price\")","v":"Whalen Price"}]
[]
[null,null,null,{"$f":"IF(C11=\"\",\"\",\"Your selected location reports Cooling Load Hours of\")","v":"Your selected location reports Cooling Load Hours of"},{"$f":"IF(C11=\"\",\"\",ROUND(VLOOKUP(C11&\", \"&C9,data!$D$2:$Q$993,2,FALSE),\"0\"))","v":1254},null,null,80," Pump Efficiency (%)",null,null,1652]
[null,null,null,{"$f":"IF(C11=\"\",\"\",\"Your selected location reports Heating Load Hours of\")","v":"Your selected location reports Heating Load Hours of"},{"$f":"IF(C11=\"\",\"\",ROUND(VLOOKUP(C11&\", \"&C9,data!$D$2:$Q$993,3,FALSE),\"0\"))","v":2298}]
[]
[]
[{"$f":"IF(C25=\"\",\"Unit 1 Information\",\"Unit 1 Information: \"&VLOOKUP(C25,'AHRI Ratings'!$C$2:$X$909,22,FALSE)&\" Operation\")","v":"Unit 1 Information: 1-Stage Operation"}]
[]
[null,"Manufacturer:","Whalen",null,"Loop Type:","Water Loop"]
[]
[null,"Series:","VI",null,"Diversity Factor:",0.8,null,null,null,"Price per Million BTU",{"$f":"ROUND(VLOOKUP(C11&\", \"&C9,data!$D$2:$R$993,15,FALSE),3)/10.23","v":0.97751710654936452}]
[null,null,null,null,null,null,null,null,null,"Cost per Million BTU output",{"$f":"(K23/(100000*(D38/100))*1000000)","v":181.02168639803045}]
[null,"Model:","VI-A-303",null,"Percent Full Stage:",0.2]
[]
[null,"Rated Cooling Performance",null,null,"Operating Performance"]
[null,null,"Full Load Capacity (btuh)",{"$f":"IF($F$21<>\"\",IF($F$21=\"Air Source\",VLOOKUP($C$25,'AHRI Ratings'!$C$2:$W$909,4,FALSE),IF($F$21=\"Water Loop\",VLOOKUP($C$25,'AHRI Ratings'!$C$2:$W$909,4,FALSE),IF($F$21=\"Ground Water\",VLOOKUP($C$25,'AHRI Ratings'!$C$2:$W$909,10,FALSE),VLOOKUP($C$25,'AHRI Ratings'!$C$2:$W$909,16,FALSE)))),\"\")","v":9300},null,"Demand, kW",{"$f":"IF(VLOOKUP(C25,'AHRI Ratings'!$C$2:$X$909,22,FALSE)=\"2-Stage\",IF(C11=\"\",\"\",ROUND(((G32/G33)/1000),2)),IF(C11=\"\",\"\",ROUND(((D28/D30)/1000),2)))","v":0.65}]
[null,null,{"$f":"IF(VLOOKUP(C25,'AHRI Ratings'!$C$2:$X$909,22,FALSE)=\"2-Stage\",\"Part Load capacity (btuh)\", \"\")","v":""},{"$f":"IF(VLOOKUP($C$25,'AHRI Ratings'!$C$2:$X$909,22,FALSE)=\"2-Stage\",IF($F$21<>\"\",IF($F$21=\"Air Source\", INDEX('AHRI Part Load Ratings'!$F$2:$F$249,MATCH($C$25,'AHRI Part Load Ratings'!$C$2:$C$249,0)+1),IF($F$21=\"Water Loop\", INDEX('AHRI Part Load Ratings'!$F$2:$F$249,MATCH($C$25,'AHRI Part Load Ratings'!$C$2:$C$249,0)+1),IF($F$21=\"Ground Water\", INDEX('AHRI Part Load Ratings'!$L$2:$L$249,MATCH($C$25,'AHRI Part Load Ratings'!$C$2:$C$249,0)+1), INDEX('AHRI Part Load Ratings'!$R$2:$R$249,MATCH($C$25,'AHRI Part Load Ratings'!$C$2:$C$249,0)+1)))),\"\"),\"\")","v":""},null,"Annual Cooling kWh",{"$f":"IF(C11=\"\",\"\",G28*$E$15*F23)","v":652.08000000000004}]
[null,null,"Full Load EER",{"$f":"IF($F$21<>\"\",IF($F$21=\"Air Source\",VLOOKUP($C$25,'AHRI Ratings'!$C$2:$W$909,5,FALSE),IF($F$21=\"Water Loop\",VLOOKUP($C$25,'AHRI Ratings'!$C$2:$W$909,5,FALSE),IF($F$21=\"Ground Water\",VLOOKUP($C$25,'AHRI Ratings'!$C$2:$W$909,11,FALSE),VLOOKUP($C$25,'AHRI Ratings'!$C$2:$W$909,17,FALSE)))),\"\")","v":14.4},null,"Annual Cooling cost",{"$f":"IF(C11=\"\",\"\",G29*$E$13)","v":67.816320000000005}]
[null,null,{"$f":"IF(VLOOKUP(C25,'AHRI Ratings'!$C$2:$X$909,22,FALSE)=\"2-Stage\",\"Part Load EER\",\"\")","v":""},{"$f":"IF(VLOOKUP($C$25,'AHRI Ratings'!$C$2:$X$909,22,FALSE)=\"2-Stage\",IF($F$21<>\"\",IF($F$21=\"Air Source\", INDEX('AHRI Part Load Ratings'!$G$2:$G$249,MATCH($C$25,'AHRI Part Load Ratings'!$C$2:$C$249,0)+1),IF($F$21=\"Water Loop\", INDEX('AHRI Part Load Ratings'!$G$2:$G$249,MATCH($C$25,'AHRI Part Load Ratings'!$C$2:$C$249,0)+1),IF($F$21=\"Ground Water\", INDEX('AHRI Part Load Ratings'!$M$2:$M$249,MATCH($C$25,'AHRI Part Load Ratings'!$C$2:$C$249,0)+1), INDEX('AHRI Part Load Ratings'!$S$2:$S$249,MATCH($C$25,'AHRI Part Load Ratings'!$C$2:$C$249,0)+1)))),\"\"),\"\")","v":""}]
[null,null,{"$f":"IF($F$21=\"Air Source\",\"\", \"Full Load Cooling GPM\")","v":"Full Load Cooling GPM"},{"$f":"IF($F$21=\"Air Source\",\"\",IF(VLOOKUP($C$25,'AHRI Ratings'!$C$2:$X$909,22,FALSE)=\"2-Stage\",IF($F$21<>\"\",IF($F$21=\"Air Source\", INDEX('AHRI Part Load Ratings'!$H$2:$H$249,MATCH($C$25,'AHRI Part Load Ratings'!$C$2:$C$249,0)+0),IF($F$21=\"Water Loop\", INDEX('AHRI Part Load Ratings'!$H$2:$H$249,MATCH($C$25,'AHRI Part Load Ratings'!$C$2:$C$249,0)+0),IF($F$21=\"Water\", INDEX('AHRI Part Load Ratings'!$N$2:$N$249,MATCH($C$25,'AHRI Part Load Ratings'!$C$2:$C$249,0)+0), INDEX('AHRI Part Load Ratings'!$T$2:$T$249,MATCH($C$25,'AHRI Part Load Ratings'!$C$2:$C$249,0)+0)))),\"\"),IF($F$21<>\"\",IF($F$21=\"Air Source\", INDEX('AHRI Ratings'!$H$2:$H$909,MATCH($C$25,'AHRI Ratings'!$C$2:$C$909,0)),IF($F$21=\"Water Loop\", INDEX('AHRI Ratings'!$H$2:$H$909,MATCH($C$25,'AHRI Ratings'!$C$2:$C$909,0)),IF($F$21=\"Ground Water\", INDEX('AHRI Ratings'!$N$2:$N$909,MATCH($C$25,'AHRI Ratings'!$C$2:$C$909,0)), INDEX('AHRI Ratings'!$T$2:$T$909,MATCH($C$25,'AHRI Ratings'!$C$2:$C$909,0))))),\"\")))","v":2.5},null,"Operating Capacity",{"$f":"IF(VLOOKUP(C25,'AHRI Ratings'!$C$2:$X$909,22,FALSE)=\"2-Stage\",(D28*F25)+(D29*(1-F25)),D28)","v":9300}]
[null,null,{"$f":"IF(VLOOKUP($C$25,'AHRI Ratings'!$C$2:$X$909,22,FALSE)=\"2-Stage\",IF($F$21=\"Air Source\",\"\", \"Part Load Cooling GPM\"),\"\")","v":""},{"$f":"IF(VLOOKUP($C$25,'AHRI Ratings'!$C$2:$X$909,22,FALSE)=\"2-Stage\",IF($F$21=\"Air Source\",\"\",IF(VLOOKUP($C$25,'AHRI Ratings'!$C$2:$X$909,22,FALSE)=\"2-Stage\",IF($F$21<>\"\",IF($F$21=\"Air Source\", INDEX('AHRI Part Load Ratings'!$H$2:$H$249,MATCH($C$25,'AHRI Part Load Ratings'!$C$2:$C$249,0)+1),IF($F$21=\"Water Loop\", INDEX('AHRI Part Load Ratings'!$H$2:$H$249,MATCH($C$25,'AHRI Part Load Ratings'!$C$2:$C$249,0)+1),IF($F$21=\"Water\", INDEX('AHRI Part Load Ratings'!$N$2:$N$249,MATCH($C$25,'AHRI Part Load Ratings'!$C$2:$C$249,0)+1), INDEX('AHRI Part Load Ratings'!$T$2:$T$249,MATCH($C$25,'AHRI Part Load Ratings'!$C$2:$C$249,0)+1)))),\"\"),IF($F$21<>\"\",IF($F$21=\"Air Source\", INDEX('AHRI Ratings'!$H$2:$H$909,MATCH($C$25,'AHRI Ratings'!$C$2:$C$909,0)),IF($F$21=\"Water Loop\", INDEX('AHRI Ratings'!$H$2:$H$909,MATCH($C$25,'AHRI Ratings'!$C$2:$C$909,0)),IF($F$21=\"Ground Water\", INDEX('AHRI Ratings'!$N$2:$N$909,MATCH($C$25,'AHRI Ratings'!$C$2:$C$909,0)), INDEX('AHRI Ratings'!$T$2:$T$909,MATCH($C$25,'AHRI Ratings'!$C$2:$C$909,0))))),\"\"))),\"\")","v":""},null,"Operating Efficiency",{"$f":"IF(VLOOKUP(C25,'AHRI Ratings'!$C$2:$X$909,22,FALSE)=\"2-Stage\",(D30*F25)+(D31*(1-F25)),D30)","v":14.4},null,null,{"$f":"IF(VLOOKUP($C$25,'AHRI Ratings'!$C$2:$X$909,22,FALSE)=\"2-Stage\",(D32*F25)+(D33*(1-F25)),D32)","v":2.5}]
[null,null,{"$f":"IF($F$21=\"Air Source\",\"Fan Motor HP\", \"\")","v":""},{"$f":"IF($F$21=\"Air Source\",VLOOKUP($C$25,'AHRI Ratings'!$C$2:$W$909,10,FALSE),\"\")","v":""}]
[null,"Rated Heating Performance",null,null,"Operating Performance"]
[null,null,{"$f":"IF($F$21=\"Air Source\",\"Gas Furnace Output (btuh)\", \"Full Load Capacity (btuh)\")","v":"Full Load Capacity (btuh)"},{"$f":"IF($F$21<>\"\",IF($F$21=\"Air Source\",VLOOKUP($C$25,'AHRI Ratings'!$C$2:$W$909,7,FALSE),IF($F$21=\"Water Loop\",VLOOKUP($C$25,'AHRI Ratings'!$C$2:$W$909,7,FALSE),IF($F$21=\"Ground Water\",VLOOKUP($C$25,'AHRI Ratings'!$C$2:$W$909,13,FALSE),VLOOKUP($C$25,'AHRI Ratings'!$C$2:$W$909,19,FALSE)))),\"\")","v":12000},null,"Demand, kW",{"$f":"IF(VLOOKUP($C$25,'AHRI Ratings'!$C$2:$X$909,22,FALSE)=\"2-Stage\",IF($F$21=\"Air Source\",\"\",IF($C$25=\"\",\"\",ROUND(((G40/G41)/3.412142)/1000,2))),IF($C$25=\"\",\"\",IF($F$21=\"Air Source\",ROUND((D41*745.699)/1000,2),ROUND(((D36/D38)/3.412142/1000),2))))","v":0.65}]
[null,null,{"$f":"IF(VLOOKUP($C$25,'AHRI Ratings'!$C$2:$X$909,22,FALSE)=\"2-Stage\",IF($F$21=\"Air Source\",\"\", \"Part Load Capacity (btuh)\"),\"\")","v":""},{"$f":"IF(VLOOKUP($C$25,'AHRI Ratings'!$C$2:$X$909,22,FALSE)=\"2-Stage\",IF($F$21<>\"\",IF($F$21=\"Air Source\", INDEX('AHRI Part Load Ratings'!$I$2:$I$249,MATCH($C$25,'AHRI Part Load Ratings'!$C$2:$C$249,0)+1),IF($F$21=\"Water Loop\", INDEX('AHRI Part Load Ratings'!$I$2:$I$249,MATCH($C$25,'AHRI Part Load Ratings'!$C$2:$C$249,0)+1),IF($F$21=\"Ground Water\", INDEX('AHRI Part Load Ratings'!$O$2:$O$249,MATCH($C$25,'AHRI Part Load Ratings'!$C$2:$C$249,0)+1), INDEX('AHRI Part Load Ratings'!$U$2:$U$249,MATCH($C$25,'AHRI Part Load Ratings'!$C$2:$C$249,0)+1)))),\"\"),\"\")","v":""},null,"Annual Cooling kWh",{"$f":"$G$36*$E$16*$F$23","v":1194.96}]
[null,null,{"$f":"IF($F$21=\"Air Source\",\"AFUE\", \"Rated Full Load COP\")","v":"Rated Full Load COP"},{"$f":"IF($F$21<>\"\",IF($F$21=\"Air Source\",VLOOKUP($C$25,'AHRI Ratings'!$C$2:$W$909,8,FALSE),IF($F$21=\"Water Loop\",VLOOKUP($C$25,'AHRI Ratings'!$C$2:$W$909,8,FALSE),IF($F$21=\"Ground Water\",VLOOKUP($C$25,'AHRI Ratings'!$C$2:$W$909,14,FALSE),VLOOKUP($C$25,'AHRI Ratings'!$C$2:$W$909,20,FALSE)))),\"\")","v":5.4},null,"Annual Heating cost",{"$f":"IF($C$11=\"\",\"\",IF($F$21=\"Air Source\",ROUND((G39*K24)+(G37*$E$13),0),ROUND(G37*$E$13,0)))","v":124}]
[null,null,{"$f":"IF(VLOOKUP($C$25,'AHRI Ratings'!$C$2:$X$909,22,FALSE)=\"2-Stage\",IF($F$21=\"Air Source\",\"\", \"Rated Part Load COP\"),\"\")","v":""},{"$f":"IF(VLOOKUP($C$25,'AHRI Ratings'!$C$2:$X$909,22,FALSE)=\"2-Stage\",IF($F$21<>\"\",IF($F$21=\"Air Source\", INDEX('AHRI Part Load Ratings'!$J$2:$J$249,MATCH($C$25,'AHRI Part Load Ratings'!$C$2:$C$249,0)+1),IF($F$21=\"Water Loop\", INDEX('AHRI Part Load Ratings'!$J$2:$J$249,MATCH($C$25,'AHRI Part Load Ratings'!$C$2:$C$249,0)+1),IF($F$21=\"Ground Water\", INDEX('AHRI Part Load Ratings'!$P$2:$P$249,MATCH($C$25,'AHRI Part Load Ratings'!$C$2:$C$249,0)+1), INDEX('AHRI Part Load Ratings'!$V$2:$V$249,MATCH($C$25,'AHRI Part Load Ratings'!$C$2:$C$249,0)+1)))),\"\"),\"\")","v":""},null,{"$f":"IF($F$21=\"Air Source\",\"MMBtu Consumed / Year\",\"\")","v":""},{"$f":"IF($F$21=\"Air Source\",(((D36*100)/D38)*$E$16)/1000000,\"\")","v":""}]
[null,null,{"$f":"IF($F$21=\"Air Source\",\"\", \"Full Load Heating GPM\")","v":"Full Load Heating GPM"},{"$f":"IF($F$21=\"Air Source\",\"\",IF(VLOOKUP($C$25,'AHRI Ratings'!$C$2:$X$909,22,FALSE)=\"2-Stage\",IF($F$21<>\"\",IF($F$21=\"Air Source\", INDEX('AHRI Part Load Ratings'!$K$2:$K$249,MATCH($C$25,'AHRI Part Load Ratings'!$C$2:$C$249,0)+0),IF($F$21=\"Water Loop\", INDEX('AHRI Part Load Ratings'!$K$2:$K$249,MATCH($C$25,'AHRI Part Load Ratings'!$C$2:$C$249,0)+0),IF($F$21=\"Ground Water\", INDEX('AHRI Part Load Ratings'!$Q$2:$Q$249,MATCH($C$25,'AHRI Part Load Ratings'!$C$2:$C$249,0)+0), INDEX('AHRI Part Load Ratings'!$W$2:W$249,MATCH($C$25,'AHRI Part Load Ratings'!$C$2:$C$249,0)+0)))),\"\"),IF($F$21<>\"\",IF($F$21=\"AirSource\", INDEX('AHRI Ratings'!$H$2:$H$909,MATCH($C$25,'AHRI Ratings'!$C$2:$C$909,0)),IF($F$21=\" Water Loop\", INDEX('AHRI Part Load Ratings'!$H$2:$H$909,MATCH($C$25,'AHRI Ratings'!$C$2:$C$909,0)),IF($F$21=\"Ground Water\", INDEX('AHRI Ratings'!$N$2:$N$909,MATCH($C$25,'AHRI Ratings'!$C$2:$C$909,0)), INDEX('AHRI Ratings'!$T$2:$T$909,MATCH($C$25,'AHRI Ratings'!$C$2:$C$909,0))))),\"\")))","v":2.5},null,{"$f":"IF($F$21=\"Air Source\",\"Gas Furnace Output\", \"Operating Capacity\")","v":"Operating Capacity"},{"$f":"IF(VLOOKUP($C$25,'AHRI Ratings'!$C$2:$X$909,22,FALSE)=\"2-Stage\",($D$36*$F$25)+($D$37*(1-$F$25)),$D$36)","v":12000},null,null,{"$f":"IF(VLOOKUP($C$25,'AHRI Ratings'!$C$2:$X$909,22,FALSE)=\"2-Stage\",(D40*F25)+(D41*(1-F25)),D40)","v":2.5}]
[null,null,{"$f":"IF(VLOOKUP($C$25,'AHRI Ratings'!$C$2:$X$909,22,FALSE)=\"2-Stage\",IF($F$21=\"Air Source\",\"\", \"Part Load Heating GPM\"),\"\")","v":""},{"$f":"IF(VLOOKUP($C$25,'AHRI Ratings'!$C$2:$X$909,22,FALSE)=\"2-Stage\",IF($F$21=\"Air Source\",\"\",IF(VLOOKUP($C$25,'AHRI Ratings'!$C$2:$X$909,22,FALSE)=\"2-Stage\",IF($F$21<>\"\",IF($F$21=\"Air Source\", INDEX('AHRI Part Load Ratings'!$K$2:$K$249,MATCH($C$25,'AHRI Part Load Ratings'!$C$2:$C$249,0)+1),IF($F$21=\"Water Loop\", INDEX('AHRI Part Load Ratings'!$K$2:$K$249,MATCH($C$25,'AHRI Part Load Ratings'!$C$2:$C$249,0)+1),IF($F$21=\"Ground Water\", INDEX('AHRI Part Load Ratings'!$Q$2:$Q$249,MATCH($C$25,'AHRI Part Load Ratings'!$C$2:$C$249,0)+1), INDEX('AHRI Part Load Ratings'!$W$2:W$249,MATCH($C$25,'AHRI Part Load Ratings'!$C$2:$C$249,0)+1)))),\"\"),IF($F$21<>\"\",IF($F$21=\"AirSource\", INDEX('AHRI Ratings'!$H$2:$H$909,MATCH($C$25,'AHRI Ratings'!$C$2:$C$909,0)),IF($F$21=\" Water Loop\", INDEX('AHRI Part Load Ratings'!$H$2:$H$909,MATCH($C$25,'AHRI Ratings'!$C$2:$C$909,0)),IF($F$21=\"Ground Water\", INDEX('AHRI Ratings'!$N$2:$N$909,MATCH($C$25,'AHRI Ratings'!$C$2:$C$909,0)), INDEX('AHRI Ratings'!$T$2:$T$909,MATCH($C$25,'AHRI Ratings'!$C$2:$C$909,0))))),\"\"))),\"\")","v":""},null,{"$f":"IF($F$21=\"Air Source\",\"AFUE\", \"Operating Efficiency\")","v":"Operating Efficiency"},{"$f":"IF(VLOOKUP($C$25,'AHRI Ratings'!$C$2:$X$909,22,FALSE)=\"2-Stage\",($D$38*$F$25)+($D$39*(1-$F$25)),$D$38)","v":5.4}]
[null,null,{"$f":"IF($F$21=\"Air Source\",\"Fan Motor HP\", \"\")","v":""},{"$f":"IF($F$21=\"Air Source\",VLOOKUP($C$25,'AHRI Ratings'!$C$2:$W$909,10,FALSE),\"\")","v":""}]
[]
[]
[{"$f":"IF(C51=\"\",\"Unit 2 Information\",\"Unit 2 Information: \"&VLOOKUP(C51,'AHRI Ratings'!$C$2:$X$909,22,FALSE)&\" Operation\")","v":"Unit 2 Information: 1-Stage Operation"}]
[]
[null,"Manufacturer:","Whalen",null,"Loop Type:","Water Loop"]
[]
[null,"Series:","VI",null,"Diversity Factor",0.8,null,null,null,"Price per Million BTU",{"$f":"ROUND(VLOOKUP(C11&\", \"&C9,data!$D$2:$R$993,15,FALSE),3)/10.23","v":0.97751710654936452}]
[null,null,null,null,null,null,null,null,null,"Cost per Million BTU output",{"$f":"(K49/(100000*(D64/100))*1000000)","v":325.83903551645483}]
[null,"Model:","VI-A-303",null,{"$f":"IF(VLOOKUP(C51,'AHRI Ratings'!$C$2:$X$909,22,FALSE)=\"1-Stage\", \"\",\"Percent Full Stage:\")","v":""},0.2]
[]
[null,"Rated Cooling Performance",null,null,"Operating Performance"]
[null,null,"Full Load Capacity (btuh)",{"$f":"IF($F$47<>\"\",IF($F$47=\"Air Source\",VLOOKUP($C$51,'AHRI Ratings'!$C$2:$W$909,4,FALSE),IF($F$47=\"Water Loop\",VLOOKUP($C$51,'AHRI Ratings'!$C$2:$W$909,4,FALSE),IF($F$47=\"Ground Water\",VLOOKUP($C$51,'AHRI Ratings'!$C$2:$W$909,10,FALSE),VLOOKUP($C$51,'AHRI Ratings'!$C$2:$W$909,16,FALSE)))),\"\")","v":9300},null,"Demand, kW",{"$f":"IF(VLOOKUP($C$51,'AHRI Ratings'!$C$2:$X$909,22,FALSE)=\"2-Stage\",IF($C$11=\"\",\"\",ROUND((($G$58/$G$59)/1000),2)),IF($C$11=\"\",\"\",ROUND((($D$54/$D$56)/1000),2)))","v":1.1599999999999999}]
[null,null,{"$f":"IF(VLOOKUP(C51,'AHRI Ratings'!$C$2:$X$909,22,FALSE)=\"2-Stage\",\"Part Load capacity (btuh)\", \"\")","v":""},{"$f":"IF(VLOOKUP($C$51,'AHRI Ratings'!$C$2:$X$909,22,FALSE)=\"2-Stage\",IF($F$47<>\"\",IF($F$47=\"Air Source\", INDEX('AHRI Part Load Ratings'!$F$2:$F$249,MATCH($C$51,'AHRI Part Load Ratings'!$C$2:$C$249,0)+1),IF($F$47=\"Water Loop\", INDEX('AHRI Part Load Ratings'!$F$2:$F$249,MATCH($C$51,'AHRI Part Load Ratings'!$C$2:$C$249,0)+1),IF($F$47=\"Ground Water\", INDEX('AHRI Part Load Ratings'!$L$2:$L$249,MATCH($C$51,'AHRI Part Load Ratings'!$C$2:$C$249,0)+1), INDEX('AHRI Part Load Ratings'!$R$2:$R$249,MATCH($C$51,'AHRI Part Load Ratings'!$C$2:$C$249,0)+1)))),\"\"),\"\")","v":""},null,"Annual Cooling kWh",{"$f":"IF($C$11=\"\",\"\",$G$54*$E$15*$F$49)","v":1163.712}]
[null,null,"Full Load EER",8,null,"Annual Cooling cost",{"$f":"IF($C$11=\"\",\"\",$G$55*$E$13)","v":121.02604799999999}]
[null,null,{"$f":"IF(VLOOKUP(C51,'AHRI Ratings'!$C$2:$X$909,22,FALSE)=\"2-Stage\",\"Part Load EER\",\"\")","v":""},{"$f":"IF(VLOOKUP($C$51,'AHRI Ratings'!$C$2:$X$909,22,FALSE)=\"2-Stage\",IF($F$47<>\"\",IF($F$47=\"Air Source\", INDEX('AHRI Part Load Ratings'!$G$2:$G$249,MATCH($C$51,'AHRI Part Load Ratings'!$C$2:$C$249,0)+1),IF($F$47=\"Water Loop\", INDEX('AHRI Part Load Ratings'!$G$2:$G$249,MATCH($C$51,'AHRI Part Load Ratings'!$C$2:$C$249,0)+1),IF($F$47=\"Ground Water\", INDEX('AHRI Part Load Ratings'!$M$2:$M$249,MATCH($C$51,'AHRI Part Load Ratings'!$C$2:$C$249,0)+1), INDEX('AHRI Part Load Ratings'!$S$2:$S$249,MATCH($C$51,'AHRI Part Load Ratings'!$C$2:$C$249,0)+1)))),\"\"),\"\")","v":""}]
[null,null,{"$f":"IF($F$47=\"Air Source\",\"\", \"Full Load Cooling GPM\")","v":"Full Load Cooling GPM"},{"$f":"IF($F$47=\"Air Source\",\"\",IF(VLOOKUP($C$51,'AHRI Ratings'!$C$2:$X$909,22,FALSE)=\"2-Stage\",IF($F$47<>\"\",IF($F$47=\"Air Source\", INDEX('AHRI Part Load Ratings'!$H$2:$H$249,MATCH($C$51,'AHRI Part Load Ratings'!$C$2:$C$249,0)+0),IF($F$47=\"Water Loop\", INDEX('AHRI Part Load Ratings'!$H$2:$H$249,MATCH($C$51,'AHRI Part Load Ratings'!$C$2:$C$249,0)+0),IF($F$47=\"Water\", INDEX('AHRI Part Load Ratings'!$N$2:$N$249,MATCH($C$51,'AHRI Part Load Ratings'!$C$2:$C$249,0)+0), INDEX('AHRI Part Load Ratings'!$T$2:$T$249,MATCH($C$51,'AHRI Part Load Ratings'!$C$2:$C$249,0)+0)))),\"\"),IF($F$47<>\"\",IF($F$47=\"Air Source\", INDEX('AHRI Ratings'!$H$2:$H$909,MATCH($C$51,'AHRI Ratings'!$C$2:$C$909,0)),IF($F$47=\"Water Loop\", INDEX('AHRI Ratings'!$H$2:$H$909,MATCH($C$51,'AHRI Ratings'!$C$2:$C$909,0)),IF($F$47=\"Ground Water\", INDEX('AHRI Ratings'!$N$2:$N$909,MATCH($C$51,'AHRI Ratings'!$C$2:$C$909,0)), INDEX('AHRI Ratings'!$T$2:$T$909,MATCH($C$51,'AHRI Ratings'!$C$2:$C$909,0))))),\"\")))","v":2.5},null,"Operating Capacity",{"$f":"IF(VLOOKUP($C$51,'AHRI Ratings'!$C$2:$X$909,22,FALSE)=\"2-Stage\",($D$54*$F$51)+($D$55*(1-$F$51)),$D$54)","v":9300}]
[null,null,{"$f":"IF(VLOOKUP($C$51,'AHRI Ratings'!$C$2:$X$909,22,FALSE)=\"2-Stage\",IF($F$47=\"Air Source\",\"\", \"Part Load Cooling GPM\"),\"\")","v":""},{"$f":"IF(VLOOKUP($C$51,'AHRI Ratings'!$C$2:$X$909,22,FALSE)=\"2-Stage\",IF($F$47=\"Air Source\",\"\",IF(VLOOKUP($C$51,'AHRI Ratings'!$C$2:$X$909,22,FALSE)=\"2-Stage\",IF($F$47<>\"\",IF($F$47=\"Air Source\", INDEX('AHRI Part Load Ratings'!$H$2:$H$249,MATCH($C$51,'AHRI Part Load Ratings'!$C$2:$C$249,0)+1),IF($F$47=\"Water Loop\", INDEX('AHRI Part Load Ratings'!$H$2:$H$249,MATCH($C$51,'AHRI Part Load Ratings'!$C$2:$C$249,0)+1),IF($F$47=\"Water\",INDEX('AHRI Part Load Ratings'!$N$2:$N$249,MATCH($C$51,'AHRI Part Load Ratings'!$C$2:$C$249,0)+1), INDEX('AHRI Part Load Ratings'!$T$2:$T$249,MATCH($C$51,'AHRI Part Load Ratings'!$C$2:$C$249,0)+1)))),\"\"),IF($F$47<>\"\",IF($F$47=\"Air Source\", INDEX('AHRI Ratings'!$H$2:$H$909,MATCH($C$51,'AHRI Ratings'!$C$2:$C$909,0)),IF($F$47=\"Water Loop\", INDEX('AHRI Ratings'!$H$2:$H$909,MATCH($C$51,'AHRI Ratings'!$C$2:$C$909,0)),IF($F$47=\"Ground Water\", INDEX('AHRI Ratings'!$N$2:$N$909,MATCH($C$51,'AHRI Ratings'!$C$2:$C$909,0)), INDEX('AHRI Ratings'!$T$2:$T$909,MATCH($C$51,'AHRI Ratings'!$C$2:$C$909,0))))),\"\"))),\"\")","v":""},null,"Operating Efficiency",{"$f":"IF(VLOOKUP($C$51,'AHRI Ratings'!$C$2:$X$909,22,FALSE)=\"2-Stage\",IF(VLOOKUP($C$51,'AHRI Ratings'!$C$2:$X$909,22,FALSE)=\"2-Stage\",($D$56*$F$51)+($D$57*(1-$F$51)),$D$56),$D$56)","v":8},null,null,{"$f":"IF(VLOOKUP($C$51,'AHRI Ratings'!$C$2:$X$909,22,FALSE)=\"2-Stage\",(D58*F51)+(D59*(1-F51)),D58)","v":2.5}]
[null,null,{"$f":"IF($F$47=\"Air Source\",\"Fan Motor HP\", \"\")","v":""},{"$f":"IF($F$47=\"Air Source\",VLOOKUP($C$51,'AHRI Ratings'!$C$2:$W$909,10,FALSE),\"\")","v":""}]
[null,"Rated Heating Performance",null,null,"Operating Performance"]
[null,null,{"$f":"IF($F$47=\"Air Source\",\"Gas Furnace Output (btuh)\", \"Full Load Capacity (btuh)\")","v":"Full Load Capacity (btuh)"},{"$f":"IF($F$47<>\"\",IF($F$47=\"Air Source\",VLOOKUP($C$51,'AHRI Ratings'!$C$2:$W$909,7,FALSE),IF($F$47=\"Water Loop\",VLOOKUP($C$51,'AHRI Ratings'!$C$2:$W$909,7,FALSE),IF($F$47=\"Ground Water\",VLOOKUP($C$51,'AHRI Ratings'!$C$2:$W$909,13,FALSE),VLOOKUP($C$51,'AHRI Ratings'!$C$2:$W$909,19,FALSE)))),\"\")","v":12000},null,"Demand, kW",{"$f":"IF(VLOOKUP($C$51,'AHRI Ratings'!$C$2:$X$909,22,FALSE)=\"2-Stage\",IF($F$47=\"Air Source\",\"\",IF($C$51=\"\",\"\",ROUND((($G$66/$G$67)/3.412142)/1000,2))),IF($C$51=\"\",\"\",IF($F$47=\"Air Source\",ROUND(($D$68*745.699)/1000,2),ROUND((($D$62/$D$64)/3.412142/1000),2))))","v":1.17}]
[null,null,{"$f":"IF(VLOOKUP($C$51,'AHRI Ratings'!$C$2:$X$909,22,FALSE)=\"2-Stage\",IF($F$47=\"Air Source\",\"\", \"Part Load Capacity (btuh)\"),\"\")","v":""},{"$f":"IF(VLOOKUP($C$51,'AHRI Ratings'!$C$2:$X$909,22,FALSE)=\"2-Stage\",IF($F$47<>\"\",IF($F$47=\"Air Source\", INDEX('AHRI Part Load Ratings'!$I$2:$I$249,MATCH($C$51,'AHRI Part Load Ratings'!$C$2:$C$249,0)+1),IF($F$47=\"Water Loop\", INDEX('AHRI Part Load Ratings'!$I$2:$I$249,MATCH($C$51,'AHRI Part Load Ratings'!$C$2:$C$249,0)+1),IF($F$47=\"Ground Water\", INDEX('AHRI Part Load Ratings'!$O$2:$O$249,MATCH($C$51,'AHRI Part Load Ratings'!$C$2:$C$249,0)+1), INDEX('AHRI Part Load Ratings'!$U$2:$U$249,MATCH($C$51,'AHRI Part Load Ratings'!$C$2:$C$249,0)+1)))),\"\"),\"\")","v":""},null,"Annual Heating kWh",{"$f":"$G$62*$E$16*$F$49","v":2150.9279999999999}]
[null,null,{"$f":"IF($F$47=\"Air Source\",\"AFUE\", \"Rated Full Load COP\")","v":"Rated Full Load COP"},3,null,"Annual Heating cost",{"$f":"IF($C$11=\"\",\"\",IF($F$47=\"Air Source\",ROUND(($G$65*$K$50)+($G$63*$E$13),0),ROUND($G$63*$E$13,0)))","v":224}]
[null,null,{"$f":"IF(VLOOKUP($C$51,'AHRI Ratings'!$C$2:$X$909,22,FALSE)=\"2-Stage\",IF($F$47=\"Air Source\",\"\", \"Rated Part Load COP\"),\"\")","v":""},{"$f":"IF(VLOOKUP($C$51,'AHRI Ratings'!$C$2:$X$909,22,FALSE)=\"2-Stage\",IF($F$47<>\"\",IF($F$47=\"Air Source\", INDEX('AHRI Part Load Ratings'!$J$2:$J$249,MATCH($C$51,'AHRI Part Load Ratings'!$C$2:$C$249,0)+1),IF($F$47=\"Water Loop\", INDEX('AHRI Part Load Ratings'!$J$2:$J$249,MATCH($C$51,'AHRI Part Load Ratings'!$C$2:$C$249,0)+1),IF($F$47=\"Ground Water\", INDEX('AHRI Part Load Ratings'!$P$2:$P$249,MATCH($C$51,'AHRI Part Load Ratings'!$C$2:$C$249,0)+1), INDEX('AHRI Part Load Ratings'!$V$2:$V$249,MATCH($C$51,'AHRI Part Load Ratings'!$C$2:$C$249,0)+1)))),\"\"),\"\")","v":""},null,{"$f":"IF($F$47=\"Air Source\",\"MMBtu Consumed / Year\",\"\")","v":""},{"$f":"IF($F$47=\"Air Source\",((($D$62*100)/$D$64)*$E$16)/1000000,\"\")","v":""}]
[null,null,{"$f":"IF($F$47=\"Air Source\",\"\", \"Full Load Heating GPM\")","v":"Full Load Heating GPM"},{"$f":"IF($F$47=\"Air Source\",\"\",IF(VLOOKUP($C$51,'AHRI Ratings'!$C$2:$X$909,22,FALSE)=\"2-Stage\",IF($F$47<>\"\",IF($F$47=\"Air Source\", INDEX('AHRI Part Load Ratings'!$K$2:$K$249,MATCH($C$51,'AHRI Part Load Ratings'!$C$2:$C$249,0)+0),IF($F$47=\"Water Loop\", INDEX('AHRI Part Load Ratings'!$K$2:$K$249,MATCH($C$51,'AHRI Part Load Ratings'!$C$2:$C$249,0)+0),IF($F$47=\"Ground Water\", INDEX('AHRI Part Load Ratings'!$Q$2:$Q$249,MATCH($C$51,'AHRI Part Load Ratings'!$C$2:$C$249,0)+0), INDEX('AHRI Part Load Ratings'!$W$2:$W$249,MATCH($C$51,'AHRI Part Load Ratings'!$C$2:$C$249,0)+0)))),\"\"),IF($F$47<>\"\",IF($F$47=\"Air Source\", INDEX('AHRI Ratings'!$H$2:$H$909,MATCH($C$51,'AHRI Ratings'!$C$2:$C$909,0)),IF($F$47=\"Water Loop\", INDEX('AHRI Ratings'!$H$2:$H$909,MATCH($C$51,'AHRI Ratings'!$C$2:$C$909,0)),IF($F$47=\"Ground Water\", INDEX('AHRI Ratings'!$N$2:$N$909,MATCH($C$51,'AHRI Ratings'!$C$2:$C$909,0)), INDEX('AHRI Ratings'!$T$2:$T$909,MATCH($C$51,'AHRI Ratings'!$C$2:$C$909,0))))),\"\")))","v":2.5},null,{"$f":"IF($F$47=\"Air Source\",\"Gas Furnace Output\", \"Operating Capacity\")","v":"Operating Capacity"},{"$f":"IF(VLOOKUP($C$51,'AHRI Ratings'!$C$2:$X$909,22,FALSE)=\"2-Stage\",($D$62*$F$51)+($D$63*(1-$F$51)),$D$62)","v":12000},null,null,{"$f":"IF(VLOOKUP($C$51,'AHRI Ratings'!$C$2:$X$909,22,FALSE)=\"2-Stage\",(D66*F51)+(D67*(1-F51)),D66)","v":2.5}]
[null,null,{"$f":"IF(VLOOKUP($C$51,'AHRI Ratings'!$C$2:$X$909,22,FALSE)=\"2-Stage\",IF($F$47=\"Air Source\",\"\", \"Part Load Heating GPM\"),\"\")","v":""},{"$f":"IF(VLOOKUP($C$51,'AHRI Ratings'!$C$2:$X$909,22,FALSE)=\"2-Stage\",IF($F$47=\"Air Source\",\"\",IF(VLOOKUP($C$51,'AHRI Ratings'!$C$2:$X$909,22,FALSE)=\"2-Stage\",IF($F$47<>\"\",IF($F$47=\"Air Source\", INDEX('AHRI Part Load Ratings'!$K$2:$K$249,MATCH($C$51,'AHRI Part Load Ratings'!$C$2:$C$249,0)+1),IF($F$47=\"Water Loop\", INDEX('AHRI Part Load Ratings'!$K$2:$K$249,MATCH($C$51,'AHRI Part Load Ratings'!$C$2:$C$249,0)+1),IF($F$47=\"Ground Water\", INDEX('AHRI Part Load Ratings'!$Q$2:$Q$249,MATCH($C$51,'AHRI Part Load Ratings'!$C$2:$C$249,0)+1), INDEX('AHRI Part Load Ratings'!$W$2:$W$249,MATCH($C$51,'AHRI Part Load Ratings'!$C$2:$C$249,0)+1)))),\"\"),IF($F$47<>\"\",IF($F$47=\"Air Source\", INDEX('AHRI Ratings'!$H$2:$H$909,MATCH($C$51,'AHRI Ratings'!$C$2:$C$909,0)),IF($F$47=\"Water Loop\", INDEX('AHRI Ratings'!$H$2:$H$909,MATCH($C$51,'AHRI Ratings'!$C$2:$C$909,0)),IF($F$47=\"Ground Water\", INDEX('AHRI Ratings'!$N$2:$N$909,MATCH($C$51,'AHRI Ratings'!$C$2:$C$909,0)), INDEX('AHRI Ratings'!$T$2:$T$909,MATCH($C$51,'AHRI Ratings'!$C$2:$C$909,0))))),\"\"))),\"\")","v":""},null,{"$f":"IF($F$47=\"Air Source\",\"AFUE\", \"Operating Efficiency\")","v":"Operating Efficiency"},{"$f":"IF(VLOOKUP(C51,'AHRI Ratings'!$C$2:$X$909,22,FALSE)=\"2-Stage\",($D$64*$F$51)+($D$65*(1-$F$51)),$D$64)","v":3}]
[null,null,{"$f":"IF($F$47=\"Air Source\",\"Fan Motor HP\", \"\")","v":""},{"$f":"IF($F$47=\"Air Source\",VLOOKUP($C$51,'AHRI Ratings'!$C$2:$W$909,10,FALSE),\"\")","v":""}]
[]
[]
[null,{"$f":"IF(C11=\"\",\"Annual Energy Savings\",\"Annual Savings for \" &C11)","v":"Annual Savings for Baltimore - Washngtn Int'l Airport"},null,null,null,"Annual Pollution Reduction",null,null,null,"Annual Loop Pump Savings"]
[]
[{"$f":"IF(C11=\"\",\"\",C21&\" will reduce the kW demand by \"&TEXT((G54+G62)-(G28+G36),\"0.00\")&\" kW\")","v":"Whalen will reduce the kW demand by 1.03 kW"},null,null,null,null,{"$f":"IF(C11=\"\",\"\",IF((VLOOKUP(C11&\", \"&C9,data!$D$2:$Q$993,4,FALSE)/10^3)*((G55+G63)-(G29+G37))<2000,\"Greenhouse gases (CO2) reduced by \"&TEXT(((VLOOKUP(C11&\", \"&C9,data!$D$2:$Q$993,4,FALSE)/10^3)*((G55+G63)-(G29+G37))),\"0\")&\" lbs\",\"Greenhouse gases (CO2) reduced by \"&TEXT(((VLOOKUP(C11&\", \"&C9,data!$D$2:$Q$993,4,FALSE)/10^3)*((G55+G63)-(G29+G37))/2000),\"0.0\")&\" tons\"))","v":"Greenhouse gases (CO2) reduced by 1.5 tons"},null,null,null,{"$f":"IF(C11=\"\",\"\",\"System water flow is reduced by \"&TEXT(MAX(J59,J66)-MAX(J33,J40),\"0.0\")&\" GPM\")","v":"System water flow is reduced by 0.0 GPM"}]
[]
[{"$f":"IF(C11=\"\",\"\",C21&\" will reduce the annual kWh usage by \"&TEXT((G55+G63)-(G29+G37),\"0,0\")&\" kWh\")","v":"Whalen will reduce the annual kWh usage by 1,468 kWh"},null,null,null,null,{"$f":"IF(C11=\"\",\"\",\"Nitrogen Oxides (NOx) reduced by \"&TEXT((VLOOKUP(C11&\", \"&C9,data!$D$2:$Q$993,5,FALSE)/10^3)*((G55+G63)-(G29+G37)),\"0.0\")&\" pounds\")","v":"Nitrogen Oxides (NOx) reduced by 2.4 pounds"},null,null,null,{"$f":"IF(C11=\"\",\"\",\"Pumping horsepower is reduced by \"&TEXT(((MAX(J59,J66)*INDEX(SGTable,MATCH(H9,SGFluids,0),MATCH(H11,SGTemps,0))*H13)/(3960*(H15/100)))-((MAX(J33,J40)*INDEX(SGTable,MATCH(H9,SGFluids,0),MATCH(H11,SGTemps,0))*H13)/(3960*(H15/100))),\"0.00\")&\" BHP\")","v":"Pumping horsepower is reduced by 0.00 BHP"}]
[]
[{"$f":"IF(C11=\"\",\"\",C21&\" will provide annual operating savings of \"&TEXT(+((((((MAX(J59,J66)*INDEX(SGTable,MATCH(H9,SGFluids,0),MATCH(H11,SGTemps,0))*H13)/(3960*(H15/100)))-((MAX(J33,J40)*INDEX(SGTable,MATCH(H9,SGFluids,0),MATCH(H11,SGTemps,0))*H13)/(3960*(H15/100))))))*0.7457*(24*365))*VLOOKUP(C11&\", \"&C9,data!$D$2:$Q$993,9,FALSE)+(G56+G64)-(G30+G38),\"$0,0\"))","v":"Whalen will provide annual operating savings of $153"},null,null,null,null,{"$f":"IF(C11=\"\",\"\",\"Sulfur Dioxides (SO2) reduced by \"&TEXT((VLOOKUP(C11&\", \"&C9,data!$D$2:$Q$993,6,FALSE)/10^3)*((G55+G63)-(G29+G37)),\"0.0\")&\" pounds\")","v":"Sulfur Dioxides (SO2) reduced by 23.3 pounds"},null,null,null,{"$f":"IF(C11=\"\",\"\",\"Annual pump electrical savings is \"&TEXT((((((MAX(J59,J66)*INDEX(SGTable,MATCH(H9,SGFluids,0),MATCH(H11,SGTemps,0))*H13)/(3960*(H15/100)))-((MAX(J33,J40)*INDEX(SGTable,MATCH(H9,SGFluids,0),MATCH(H11,SGTemps,0))*H13)/(3960*(H15/100))))))*0.7457*(24*365),\"0.00\")&\" kWh\")","v":"Annual pump electrical savings is 0.00 kWh"}]
[]
[{"$f":"IF(C11=\"\",\"\",IF((L11-L15)/((G58+G66)-(G30+G38))<0,C21&\" will yield an immediate payback\",C21&\" will yield a simple payback period of \"&TEXT((L11-L15)/(((((((MAX(J59,J66)*INDEX(SGTable,MATCH(H9,SGFluids,0),MATCH(H11,SGTemps,0))*H13)/(3960*(H15/100)))-((MAX(J33,J40)*INDEX(SGTable,MATCH(H9,SGFluids,0),MATCH(H11,SGTemps,0))*H13)/(3960*(H15/100))))))*0.7457*(24*365))*VLOOKUP(C11&\", \"&C9,data!$D$2:$Q$993,9,FALSE)+(G56+G64)-(G30+G38)),\"0.0\")&\" years\"))","v":"Whalen will yield a simple payback period of 2.1 years"},null,null,null,null,{"$f":"IF(C11=\"\",\"\",\"Methane (CH4) reduced by \"&TEXT((VLOOKUP(C11&\", \"&C9,data!$D$2:$Q$993,4,FALSE)/10^6)*((G55+G63)-(G29+G37)),\"0.00\")&\" pounds\")","v":"Methane (CH4) reduced by 2.91 pounds"},null,null,null,{"$f":"IF(C11=\"\",\"\",\"Annual pump savings is $\"&TEXT(((((((MAX(J59,J66)*INDEX(SGTable,MATCH(H9,SGFluids,0),MATCH(H11,SGTemps,0))*H13)/(3960*(H15/100)))-((MAX(J33,J40)*INDEX(SGTable,MATCH(H9,SGFluids,0),MATCH(H11,SGTemps,0))*H13)/(3960*(H15/100))))))*0.7457*(24*365))*VLOOKUP(C11&\", \"&C9,data!$D$2:$Q$993,9,FALSE),\"0.00\"))","v":"Annual pump savings is $0.00"}]
[]
[]
[null,null,{"$f":"Comparison!C21","v":"Whalen"},{"$f":"Comparison!C47","v":"Whalen"},null,null,null,"Year 1","Year 5","Year 10","Year 15","Year 20"]
[null,"Cooling Capacity",{"$f":"G32","v":9300},{"$f":"G58","v":9300},null,{"$f":"C21","v":"Whalen"},null,{"$f":"G30+G38","v":191.81632000000002},{"$f":"H83*5","v":959.08160000000009},{"$f":"H83*10","v":1918.1632000000002},{"$f":"H83*15","v":2877.2448000000004},{"$f":"H83*20","v":3836.3264000000004}]
[null,"Heating Capacity",{"$f":"G40","v":12000},{"$f":"G66","v":12000},null,{"$f":"C47","v":"Whalen"},null,{"$f":"G56+G64","v":345.026048},{"$f":"H84*5","v":1725.13024},{"$f":"H84*10","v":3450.2604799999999},{"$f":"H84*15","v":5175.3907200000003},{"$f":"H84*20","v":6900.5209599999998}]
[null,"EER",{"$f":"G33","v":14.4},{"$f":"G59","v":8}]
[null,"COP",{"$f":"IF($F$21=\"Air Source\",\"\", G41)","v":5.4},{"$f":"IF($F$47=\"Air Source\",\"\", G67)","v":3}]
[null,{"$f":"Comparison!C32","v":"Full Load Cooling GPM"},{"$f":"Comparison!D32","v":2.5},{"$f":"Comparison!D58","v":2.5}]
[null,{"$f":"Comparison!C40","v":"Full Load Heating GPM"},{"$f":"Comparison!D40","v":2.5},{"$f":"IF(F47=\"Air Source\",\"\",Comparison!D66)","v":2.5}]

{"sheet":"data","index":1,"n_rows":1030,"n_cols":29,"rows_kept":1030,"cut":false,"hidden":true,"merged":[[0,20,0,28],[11,20,11,28],[10,19,10,28]]}
["Country","State","City","City & State","CLH","HLH","State annual CO2 non-baseload  output emission rate (lb/MWh) ","State annual NOx non-baseload output emission rate (lb/MWh)","State annual SO2 non-baseload output emission rate (lb/MWh) ","State annual CH4 non-baseload output emission rate (lb/GWh)","Residential electric cost ($/kWh)","Commercial electric cost ($/kWh)","Industrial electric cost ($/kWh)","Heating 99% DB","Cooling 2% DB","HDD65","CDD65","Commercial Natural Gas Price\n($/thousand ft3)",null,null,"Density"]
["USA","Alabama","Anniston",{"$f":"C2&\", \"&B2","v":"Anniston, Alabama"},1763,1596,1568.9645,1.3754999999999999,7.0098000000000003,28.080100000000002,0.11398,0.10634,6.225E-2,24.5,90.3,2694,1859,12.55,null,"deg C",4.4444444444444446,10,15.555555555555557,21.111111111111111,26.666666666666668,32.222222222222221,37.777777777777779,43.333333333333336,48.888888888888893]
["USA","Alabama","Auburn-Opelika","Auburn-Opelika, Alabama",1821,1533,1568.9645,1.3754999999999999,7.0098000000000003,28.080100000000002,0.11398,0.10634,6.225E-2,27.7,89.5,2383,1859,12.55,null,"deg F",40,50,60,70,80,90,100,110,120]
["USA","Alabama","Birmingham","Birmingham, Alabama",1826,1576,1568.9645,1.3754999999999999,7.0098000000000003,28.080100000000002,0.11398,0.10634,6.225E-2,24,90.6,2693,1948,12.55,null,"Water",1,1,1,1,1,1,1,1,1]
["USA","Alabama","Cairns AAF/Ozark","Cairns AAF/Ozark, Alabama",2204,1222,1568.9645,1.3754999999999999,7.0098000000000003,28.080100000000002,0.11398,0.10634,6.225E-2,30.3,91.3,1767,2415,12.55,null,"Ethanol",0.77352706179903696,0.77724424544371895,0.78100634822486337,0.78474578622906599,0.78859936560283928,0.79243028515381486,0.7963787185694603,0.80030451821026993,0.80435135145431758]
["USA","Alabama","Centreville","Centreville, Alabama",1837,1509,1568.9645,1.3754999999999999,7.0098000000000003,28.080100000000002,0.11398,0.10634,6.225E-2,25.8,89.8,2465,1898,12.55,null,"Methanol",0.77350384225764879,0.77759736792740386,0.78174440013786106,0.78587048168614781,0.79012671952670943,0.79436217498468598,0.79873198960142733,0.80308122624878064,0.80756922522338581]
["USA","Alabama","Dauphin Island","Dauphin Island, Alabama",3010,1141,1568.9645,1.3754999999999999,7.0098000000000003,28.080100000000002,0.11398,0.10634,6.225E-2,37.6,86,1303,2634,12.55,null,"Ethylene glycol",1.0922729072381578,1.0944225258649753,1.0965857945202544,1.0987238461515758,1.100914558214654,1.1030798196418312,1.1052985006690756,1.1074914946430929,1.1097386836966434]
["USA","Alabama","Dothan","Dothan, Alabama",2273,1223,1568.9645,1.3754999999999999,7.0098000000000003,28.080100000000002,0.11398,0.10634,6.225E-2,31.1,91.2,1727,2481,12.55,null,"Propylene glycol",0.95801943148094759,0.96074572137601921,0.96349414950471379,0.96621530928992494,0.96900842306202206,0.97177400569981875,0.97461290383280264,0.97742400607338153,0.98030982360216279]
["USA","Alabama","Gadsen","Gadsen, Alabama",1501,1799,1568.9645,1.3754999999999999,7.0098000000000003,28.080100000000002,0.11398,0.10634,6.225E-2,22.1,89.9,3215,1557,12.55]
["USA","Alabama","Huntsville Int'l / Jones Field","Huntsville Int'l / Jones Field, Alabama",1666,1736,1568.9645,1.3754999999999999,7.0098000000000003,28.080100000000002,0.11398,0.10634,6.225E-2,21.6,90.1,3140,1742,12.55]
["USA","Alabama","Maxwell AFB / Montgomery","Maxwell AFB / Montgomery, Alabama",2203,1299,1568.9645,1.3754999999999999,7.0098000000000003,28.080100000000002,0.11398,0.10634,6.225E-2,31.5,93.3,1813,2598,12.55,null,"Specific Gravity of Anti-Freeze Mixture at various Temperatures"]
["USA","Alabama","Mobile","Mobile, Alabama",2336,1163,1568.9645,1.3754999999999999,7.0098000000000003,28.080100000000002,0.11398,0.10634,6.225E-2,30.7,90.3,1662,2463,12.55,null,null,"Degree F"]
["USA","Alabama","Montgomery","Montgomery, Alabama",2021,1364,1568.9645,1.3754999999999999,7.0098000000000003,28.080100000000002,0.11398,0.10634,6.225E-2,27.3,92.1,2143,2282,12.55,null,"Mixture",40,50,60,70,80,90,100,110,120]
["USA","Alabama","Muscle Shoals","Muscle Shoals, Alabama",1688,1725,1568.9645,1.3754999999999999,7.0098000000000003,28.080100000000002,0.11398,0.10634,6.225E-2,22.1,90.9,3084,1822,12.55,null,"Water",1,1,1,1,1,1,1,1,1]
["USA","Alabama","Tuscaloosa","Tuscaloosa, Alabama",1910,1505,1568.9645,1.3754999999999999,7.0098000000000003,28.080100000000002,0.11398,0.10634,6.225E-2,25,91.4,2509,2101,12.55,null,"5% Ethanol",{"$f":"((95*U$4)+(5*U$5))/100","v":0.98867635308995194},{"$f":"((95*V$4)+(5*V$5))/100","v":0.98886221227218596},0.98905031741124316,0.98923728931145338,0.98942996828014207,0.98962151425769074,0.98981893592847303,0.9900152259105135,0.99021756757271584]
["USA","Alaska","Fairbanks","Fairbanks, Alaska",178,3149,1348.2862,5.7268999999999997,1.8946000000000001,38.4131,0.17882999999999999,0.14927000000000001,0.16821,-38.1,74.599999999999994,13528,71,8.09,null,"10% Ethanol",{"$f":"((90*U$4)+(10*U$5))/100","v":0.97735270617990366},{"$f":"((90*V$4)+(10*V$5))/100","v":0.97772442454437192},0.97810063482248633,0.97847457862290654,0.97885993656028392,0.97924302851538148,0.97963787185694595,0.98003045182102699,0.98043513514543179]
["USA","Alaska","Ft. Richardson","Ft. Richardson, Alaska",26,3322,1348.2862,5.7268999999999997,1.8946000000000001,38.4131,0.17882999999999999,0.14927000000000001,0.16821,-12.5,67.8,10726,3,8.09,null,"15% Ethanol",{"$f":"((85*U$4)+(15*U$5))/100","v":0.96602905926985561},{"$f":"((85*V$4)+(15*V$5))/100","v":0.96658663681655776},0.9671509522337296,0.96771186793435993,0.96828990484042587,0.96886454277307221,0.96945680778541898,0.97004567773154049,0.97065270271814763]
["USA","Alaska","Anchorage / Elmendorf AFB","Anchorage / Elmendorf AFB, Alaska",88,2825,1348.2862,5.7268999999999997,1.8946000000000001,38.4131,0.17882999999999999,0.14927000000000001,0.16821,-23,68,10360,11,8.09,null,"20% Ethanol",{"$f":"((80*U$4)+(20*U$5))/100","v":0.95470541235980733},{"$f":"((80*V$4)+(20*V$5))/100","v":0.95544884908874383},0.95620126964497276,0.9569491572458132,0.95771987312056783,0.95848605703076306,0.95927574371389202,0.96006090364205388,0.96087027029086358]
["USA","Alaska","Lake Hood Seaplane","Lake Hood Seaplane, Alaska",120,2771,1348.2862,5.7268999999999997,1.8946000000000001,38.4131,0.17882999999999999,0.14927000000000001,0.16821,-20.100000000000001,68.2,9824,16,8.09,null,"25% Ethanol",{"$f":"((75*U$4)+(25*U$5))/100","v":0.94338176544975927},{"$f":"((75*V$4)+(25*V$5))/100","v":0.94431106136092979},0.94525158705621581,0.94618644655726658,0.94714984140070979,0.94810757128845369,0.94909467964236516,0.95007612955256748,0.95108783786357942]
["USA","Alaska","Anchorage Int'l Airport","Anchorage Int'l Airport, Alaska",133,2851,1348.2862,5.7268999999999997,1.8946000000000001,38.4131,0.17882999999999999,0.14927000000000001,0.16821,-20.2,65.900000000000006,10121,5,8.09,null,"5% Methanol",{"$f":"((95*U$4)+(5*U$6))/100","v":0.98867519211288235},{"$f":"((95*V$4)+(5*V$6))/100","v":0.98887986839637021},0.98908722000689309,0.98929352408430749,0.98950633597633542,0.98971810874923438,0.9899365994800714,0.9901540613124391,0.99037846126116935]
["USA","Alaska","Anchorage Merrill Field","Anchorage Merrill Field, Alaska",83,2793,1348.2862,5.7268999999999997,1.8946000000000001,38.4131,0.17882999999999999,0.14927000000000001,0.16821,-21.6,67.900000000000006,10079,10,8.09,null,"10% Methanol",{"$f":"((90*U$4)+(10*U$6))/100","v":0.97735038422576492},{"$f":"((90*V$4)+(10*V$6))/100","v":0.97775973679274042},0.97817444001378617,0.97858704816861475,0.97901267195267094,0.97943621749846854,0.97987319896014269,0.9803081226248781,0.98075692252233859]
["USA","Alaska","Juneau","Juneau, Alaska",48,3521,1348.2862,5.7268999999999997,1.8946000000000001,38.4131,0.17882999999999999,0.14927000000000001,0.16821,8.1999999999999993,66.5,8333,3,8.09,null,"15% Methanol",{"$f":"((85*U$4)+(15*U$6))/100","v":0.96602557633864738},{"$f":"((85*V$4)+(15*V$6))/100","v":0.96663960518911052},0.96726166002067915,0.96788057225292223,0.96851900792900636,0.96915432624770292,0.96980979844021409,0.97046218393731709,0.97113538378350783]
["USA","Alaska","Nome","Nome, Alaska",0,3668,1348.2862,5.7268999999999997,1.8946000000000001,38.4131,0.17882999999999999,0.14927000000000001,0.16821,-24.2,61.6,13631,4,8.09,null,"20% Methanol",{"$f":"((80*U$4)+(20*U$6))/100","v":0.95470076845152974},{"$f":"((80*V$4)+(20*V$6))/100","v":0.95551947358548073},0.95634888002757223,0.9571740963372295,0.95802534390534189,0.9588724349969372,0.95974639792028538,0.96061624524975608,0.96151384504467718]
["USA","Arizona","Casa Granda","Casa Granda, Arizona",2133,1208,1191.4866999999999,0.77359999999999995,0.53759999999999997,20.292300000000001,0.11294,9.5299999999999996E-2,6.5320000000000003E-2,34.5,104.4,1535,3502,9.35,null,"25% Methanol",{"$f":"((75*U$4)+(25*U$6))/100","v":0.94337596056441209},{"$f":"((75*V$4)+(25*V$6))/100","v":0.94439934198185105},0.94543610003446532,0.94646762042153698,0.9475316798816773,0.94859054374617147,0.94968299740035689,0.95077030656219519,0.95189230630584643]
["USA","Arizona","Davis-Monthan AFB","Davis-Monthan AFB, Arizona",2116,1232,1191.4866999999999,0.77359999999999995,0.53759999999999997,20.292300000000001,0.11294,9.5299999999999996E-2,6.5320000000000003E-2,35.700000000000003,100.2,1504,3103,9.35,null,"5% Ethylene glycol",{"$f":"((95*U$4)+(5*U$7))/100","v":1.0046136453619079},{"$f":"((95*V$4)+(5*V$7))/100","v":1.0047211262932487},1.0048292897260127,1.0049361923075788,1.0050457279107328,1.0051539909820917,1.0052649250334538,1.0053745747321547,1.005486934184832]
["USA","Arizona","Douglas","Douglas, Arizona",1463,1528,1191.4866999999999,0.77359999999999995,0.53759999999999997,20.292300000000001,0.11294,9.5299999999999996E-2,6.5320000000000003E-2,25.5,94.5,2515,1798,9.35,null,"10% Ethylene glycol",{"$f":"((90*U$4)+(10*U$7))/100","v":1.0092272907238158},{"$f":"((90*V$4)+(10*V$7))/100","v":1.0094422525864974},1.0096585794520254,1.0098723846151576,1.0100914558214655,1.0103079819641831,1.0105298500669075,1.0107491494643093,1.0109738683696643]
["USA","Arizona","Flagstaff","Flagstaff, Arizona",166,2984,1191.4866999999999,0.77359999999999995,0.53759999999999997,20.292300000000001,0.11294,9.5299999999999996E-2,6.5320000000000003E-2,9.4,80.599999999999994,6912,108,9.35,null,"15% Ethylene glycol",{"$f":"((85*U$4)+(15*U$7))/100","v":1.0138409360857237},{"$f":"((85*V$4)+(15*V$7))/100","v":1.0141633788797464},1.0144878691780381,1.0148085769227364,1.0151371837321981,1.0154619729462746,1.0157947751003613,1.016123724196464,1.0164608025544966]
["USA","Arizona","Kingman","Kingman, Arizona",1481,1960,1191.4866999999999,0.77359999999999995,0.53759999999999997,20.292300000000001,0.11294,9.5299999999999996E-2,6.5320000000000003E-2,27.1,96.9,3095,1968,9.35,null,"20% Ethylene glycol",{"$f":"((80*U$4)+(20*U$7))/100","v":1.0184545814476316},{"$f":"((80*V$4)+(20*V$7))/100","v":1.0188845051729951},1.0193171589040508,1.0197447692303152,1.0201829116429308,1.0206159639283663,1.0210597001338151,1.0214982989286185,1.0219477367393288]
["USA","Arizona","Luke AFB / Phoenix","Luke AFB / Phoenix, Arizona",2285,1095,1191.4866999999999,0.77359999999999995,0.53759999999999997,20.292300000000001,0.11294,9.5299999999999996E-2,6.5320000000000003E-2,37.700000000000003,106.2,1245,3923,9.35,null,"25% Ethylene glycol",{"$f":"((75*U$4)+(25*U$7))/100","v":1.0230682268095395},{"$f":"((75*V$4)+(25*V$7))/100","v":1.0236056314662438},1.0241464486300635,1.0246809615378938,1.0252286395536634,1.0257699549104577,1.0263246251672689,1.0268728736607733,1.0274346709241609]
["USA","Arizona","Nogales","Nogales, Arizona",1447,1475,1191.4866999999999,0.77359999999999995,0.53759999999999997,20.292300000000001,0.11294,9.5299999999999996E-2,6.5320000000000003E-2,29.6,95.1,2175,1815,9.35,null,"5% Propylene glycol",{"$f":"((95*U$4)+(5*U$8))/100","v":0.99790097157404745},{"$f":"((95*V$4)+(5*V$8))/100","v":0.99803728606880104},0.99817470747523573,0.99831076546449626,0.99845042115310112,0.99858870028499103,0.99873064519164023,0.99887120030366905,0.99901549118010824]
["USA","Arizona","Page","Page, Arizona",1532,2340,1191.4866999999999,0.77359999999999995,0.53759999999999997,20.292300000000001,0.11294,9.5299999999999996E-2,6.5320000000000003E-2,25.3,95.1,3870,1921,9.35,null,"10% Propylene glycol",{"$f":"((90*U$4)+(10*U$8))/100","v":0.99580194314809478},{"$f":"((90*V$4)+(10*V$8))/100","v":0.99607457213760198},0.99634941495047147,0.99662153092899242,0.99690084230620213,0.99717740056998194,0.99746129038328024,0.99774240060733821,0.99803098236021626]
["USA","Arizona","Phoenix Sky Harbor Int'l Airport","Phoenix Sky Harbor Int'l Airport, Arizona",2655,953,1191.4866999999999,0.77359999999999995,0.53759999999999997,20.292300000000001,0.11294,9.5299999999999996E-2,6.5320000000000003E-2,41.3,106.2,941,4557,9.35,null,"15% Propylene glycol",{"$f":"((85*U$4)+(15*U$8))/100","v":0.99370291472214223},{"$f":"((85*V$4)+(15*V$8))/100","v":0.9941118582064028},0.99452412242570698,0.99493229639348868,0.99535126345930336,0.99576610085497275,0.99619193557492036,0.99661360091100715,0.9970464735403245]
["USA","Arizona","Prescott Love Field","Prescott Love Field, Arizona",924,2300,1191.4866999999999,0.77359999999999995,0.53759999999999997,20.292300000000001,0.11294,9.5299999999999996E-2,6.5320000000000003E-2,20.7,89.6,4245,947,9.35,null,"20% Propylene glycol",{"$f":"((80*U$4)+(20*U$8))/100","v":0.99160388629618945},{"$f":"((80*V$4)+(20*V$8))/100","v":0.99214914427520384},0.99269882990094271,0.99324306185798494,0.99380168461240448,0.99435480113996377,0.99492258076656059,0.99548480121467631,0.99606196472043251]
["USA","Arizona","Tucson","Tucson, Arizona",2102,1150,1191.4866999999999,0.77359999999999995,0.53759999999999997,20.292300000000001,0.11294,9.5299999999999996E-2,6.5320000000000003E-2,34.4,101.3,1466,3180,9.35,null,"25% Propylene glycol",{"$f":"((75*U$4)+(25*U$8))/100","v":0.9895048578702369},{"$f":"((75*V$4)+(25*V$8))/100","v":0.99018643034400489},0.99087353737617845,0.99155382732248132,0.99225210576550549,0.99294350142495458,0.9936532259582006,0.99435600151834536,0.99507745590054075]
["USA","Arizona","Winslow","Winslow, Arizona",996,2170,1191.4866999999999,0.77359999999999995,0.53759999999999997,20.292300000000001,0.11294,9.5299999999999996E-2,6.5320000000000003E-2,15.2,92.2,4503,1129,9.35]
["USA","Arizona","Yuma Int'l Airport","Yuma Int'l Airport, Arizona",2690,804,1191.4866999999999,0.77359999999999995,0.53759999999999997,20.292300000000001,0.11294,9.5299999999999996E-2,6.5320000000000003E-2,44.7,106.6,680,4662,9.35,null,"Pump BHP =","GPM x Specific Gravity of Fluid x System Head Pressure (Ft. H2O)"]
["USA","Arizona","Yuma","Yuma, Arizona",2676,800,1191.4866999999999,0.77359999999999995,0.53759999999999997,20.292300000000001,0.11294,9.5299999999999996E-2,6.5320000000000003E-2,44.6,106.8,680,4661,9.35,null,null,null,"3960 x  Pump Efficiency"]
["USA","Arkansas","Batesville","Batesville, Arkansas",1630,1815,1186.9911,0.95879999999999999,1.6600999999999999,30.4712,9.2950000000000005E-2,7.714E-2,5.765E-2,19.7,91.4,3426,1793,7.99]
["USA","Arkansas","Bentonville","Bentonville, Arkansas",1292,1981,1186.9911,0.95879999999999999,1.6600999999999999,30.4712,9.2950000000000005E-2,7.714E-2,5.765E-2,15.9,89.8,4052,1335,7.99,null,"10% Methanol",{"$f":"MATCH(T39,T13:T34,0)","v":9}]
["USA","Arkansas","Eaker AFB","Eaker AFB, Arkansas",1761,1747,1186.9911,0.95879999999999999,1.6600999999999999,30.4712,9.2950000000000005E-2,7.714E-2,5.765E-2,17.399999999999999,92.5,3464,2018,7.99]
["USA","Arkansas","El Dorado","El Dorado, Arkansas",1869,1555,1186.9911,0.95879999999999999,1.6600999999999999,30.4712,9.2950000000000005E-2,7.714E-2,5.765E-2,25.3,93.2,2573,2196,7.99,null,60,{"$f":"MATCH(T41,SGTemps)","v":4}]
["USA","Arkansas","Fayetteville","Fayetteville, Arkansas",1360,1874,1186.9911,0.95879999999999999,1.6600999999999999,30.4712,9.2950000000000005E-2,7.714E-2,5.765E-2,14.6,90.3,3935,1434,7.99]
["USA","Arkansas","Flippin","Flippin, Arkansas",1444,1911,1186.9911,0.95879999999999999,1.6600999999999999,30.4712,9.2950000000000005E-2,7.714E-2,5.765E-2,17.8,91.3,3758,1582,7.99,null,{"$f":"INDEX(SGTable,MATCH(T39,SGFluids,0),MATCH(T41,SGTemps,0))","v":0.98908722000689309}]
["USA","Arkansas","Fort Smith","Fort Smith, Arkansas",1680,1729,1186.9911,0.95879999999999999,1.6600999999999999,30.4712,9.2950000000000005E-2,7.714E-2,5.765E-2,20.100000000000001,93.8,3234,2016,7.99]
["USA","Arkansas","Harrison FAA","Harrison FAA, Arkansas",1407,1876,1186.9911,0.95879999999999999,1.6600999999999999,30.4712,9.2950000000000005E-2,7.714E-2,5.765E-2,15.8,89.8,3845,1454,7.99]
["USA","Arkansas","Jonesboro","Jonesboro, Arkansas",1726,1832,1186.9911,0.95879999999999999,1.6600999999999999,30.4712,9.2950000000000005E-2,7.714E-2,5.765E-2,18.5,91.6,3550,1913,7.99]
["USA","Arkansas","Little Rock","Little Rock, Arkansas",1776,1796,1186.9911,0.95879999999999999,1.6600999999999999,30.4712,9.2950000000000005E-2,7.714E-2,5.765E-2,21.9,90.8,3226,1909,7.99]
["USA","Arkansas","Little Rock Adams Field","Little Rock Adams Field, Arkansas",1821,1673,1186.9911,0.95879999999999999,1.6600999999999999,30.4712,9.2950000000000005E-2,7.714E-2,5.765E-2,22.3,93,2976,2124,7.99]
["USA","Arkansas","Little Rock AFB","Little Rock AFB, Arkansas",1726,1705,1186.9911,0.95879999999999999,1.6600999999999999,30.4712,9.2950000000000005E-2,7.714E-2,5.765E-2,20.399999999999999,93.3,3168,2035,7.99]
["USA","Arkansas","Pine Bluff","Pine Bluff, Arkansas",1923,1605,1186.9911,0.95879999999999999,1.6600999999999999,30.4712,9.2950000000000005E-2,7.714E-2,5.765E-2,25.3,92.9,2655,2236,7.99]
["USA","Arkansas","Rogers","Rogers, Arkansas",1348,1981,1186.9911,0.95879999999999999,1.6600999999999999,30.4712,9.2950000000000005E-2,7.714E-2,5.765E-2,15.8,89.1,4061,1354,7.99]
["USA","Arkansas","Siloam Spring","Siloam Spring, Arkansas",1347,1960,1186.9911,0.95879999999999999,1.6600999999999999,30.4712,9.2950000000000005E-2,7.714E-2,5.765E-2,16.100000000000001,90.3,3994,1420,7.99]
["USA","Arkansas","Stuttgart","Stuttgart, Arkansas",1917,1793,1186.9911,0.95879999999999999,1.6600999999999999,30.4712,9.2950000000000005E-2,7.714E-2,5.765E-2,25.2,91.4,2973,2109,7.99]
["USA","Arkansas","Texarkana","Texarkana, Arkansas",1978,1508,1186.9911,0.95879999999999999,1.6600999999999999,30.4712,9.2950000000000005E-2,7.714E-2,5.765E-2,26.3,93.5,2431,2349,7.99]
["USA","Arkansas","Walnut Ridge","Walnut Ridge, Arkansas",1615,1927,1186.9911,0.95879999999999999,1.6600999999999999,30.4712,9.2950000000000005E-2,7.714E-2,5.765E-2,19.100000000000001,90.7,3685,1729,7.99]
["USA","California","Alameda","Alameda, California",502,2282,993.84529999999995,0.3337,3.1800000000000002E-2,35.868400000000001,0.15339,0.13406000000000001,0.10491,42.3,75.8,2158,226,7.05]
["USA","California","Bakersfield Meadows Field","Bakersfield Meadows Field, California",1616,1696,993.84529999999995,0.3337,3.1800000000000002E-2,35.868400000000001,0.15339,0.13406000000000001,0.10491,34.799999999999997,98.2,2134,2236,7.05]
["USA","California","Beale AFB / Marysvile","Beale AFB / Marysvile, California",1211,1911,993.84529999999995,0.3337,3.1800000000000002E-2,35.868400000000001,0.15339,0.13406000000000001,0.10491,34.6,95.1,2420,1519,7.05]
["USA","California","Burbank-Glendale-Passadena Airport","Burbank-Glendale-Passadena Airport, California",1356,1326,993.84529999999995,0.3337,3.1800000000000002E-2,35.868400000000001,0.15339,0.13406000000000001,0.10491,41.5,91.3,1298,1486,7.05]
["USA","California","Camarillo","Camarillo, California",612,1739,993.84529999999995,0.3337,3.1800000000000002E-2,35.868400000000001,0.15339,0.13406000000000001,0.10491,39.4,79.2,1855,362,7.05]
["USA","California","Camp Pendleton","Camp Pendleton, California",904,1366,993.84529999999995,0.3337,3.1800000000000002E-2,35.868400000000001,0.15339,0.13406000000000001,0.10491,35.6,84.2,1673,723,7.05]
["USA","California","Carlsbad / Palomar","Carlsbad / Palomar, California",1002,2086,993.84529999999995,0.3337,3.1800000000000002E-2,35.868400000000001,0.15339,0.13406000000000001,0.10491,44.9,75.400000000000006,1747,434,7.05]
["USA","California","Castle AFB / Merced","Castle AFB / Merced, California",1203,1941,993.84529999999995,0.3337,3.1800000000000002E-2,35.868400000000001,0.15339,0.13406000000000001,0.10491,32.5,94.4,2629,1474,7.05]
["USA","California","Edwards AFB","Edwards AFB, California",1347,1690,993.84529999999995,0.3337,3.1800000000000002E-2,35.868400000000001,0.15339,0.13406000000000001,0.10491,25.5,99.8,2782,1953,7.05]
["USA","California","El Toro","El Toro, California",1247,1334,993.84529999999995,0.3337,3.1800000000000002E-2,35.868400000000001,0.15339,0.13406000000000001,0.10491,43.1,85.6,1217,1070,7.05]
["USA","California","Eureka",{"$f":"C66&\", \"&B66","v":"Eureka, California"},0,3849,993.84529999999995,0.3337,3.1800000000000002E-2,35.868400000000001,0.15339,0.13406000000000001,0.10491,36.700000000000003,64.3,4539,2,7.05]
["USA","California","Fresno","Fresno, California",1487,1764,993.84529999999995,0.3337,3.1800000000000002E-2,35.868400000000001,0.15339,0.13406000000000001,0.10491,33.700000000000003,98.6,2301,2082,7.05]
["USA","California","Fullerton","Fullerton, California",1258,1347,993.84529999999995,0.3337,3.1800000000000002E-2,35.868400000000001,0.15339,0.13406000000000001,0.10491,42.8,87.5,1246,1179,7.05]
["USA","California","George AFB","George AFB, California",1479,1851,993.84529999999995,0.3337,3.1800000000000002E-2,35.868400000000001,0.15339,0.13406000000000001,0.10491,30.5,96,2661,1911,7.05]
["USA","California","Hayward","Hayward, California",505,2354,993.84529999999995,0.3337,3.1800000000000002E-2,35.868400000000001,0.15339,0.13406000000000001,0.10491,39.200000000000003,78.599999999999994,2531,286,7.05]
["USA","California","Imperial","Imperial, California",2340,832,993.84529999999995,0.3337,3.1800000000000002E-2,35.868400000000001,0.15339,0.13406000000000001,0.10491,37.5,107.3,953,4125,7.05]
["USA","California","Jack Northrop Field","Jack Northrop Field, California",1091,1462,993.84529999999995,0.3337,3.1800000000000002E-2,35.868400000000001,0.15339,0.13406000000000001,0.10491,45.6,80.599999999999994,1182,709,7.05]
["USA","California","Lancaster","Lancaster, California",1312,1787,993.84529999999995,0.3337,3.1800000000000002E-2,35.868400000000001,0.15339,0.13406000000000001,0.10491,24.8,97.3,2993,1766,7.05]
["USA","California","Lemoore Reeves NAS","Lemoore Reeves NAS, California",1325,1658,993.84529999999995,0.3337,3.1800000000000002E-2,35.868400000000001,0.15339,0.13406000000000001,0.10491,32.6,98.1,2238,1828,7.05]
["USA","California","Livermore","Livermore, California",728,2090,993.84529999999995,0.3337,3.1800000000000002E-2,35.868400000000001,0.15339,0.13406000000000001,0.10491,32.9,90.9,2796,786,7.05]
["USA","California","Lompoc","Lompoc, California",152,2267,993.84529999999995,0.3337,3.1800000000000002E-2,35.868400000000001,0.15339,0.13406000000000001,0.10491,35.200000000000003,73.7,2815,55,7.05]
["USA","California","Long Beach Daugherty Field","Long Beach Daugherty Field, California",1355,1332,993.84529999999995,0.3337,3.1800000000000002E-2,35.868400000000001,0.15339,0.13406000000000001,0.10491,43.5,84.4,1193,1095,7.05]
["USA","California","Los Angeles Int'l Airport","Los Angeles Int'l Airport, California",1157,1666,993.84529999999995,0.3337,3.1800000000000002E-2,35.868400000000001,0.15339,0.13406000000000001,0.10491,46.5,77.8,1284,617,7.05]
["USA","California","March AFB / Riverside","March AFB / Riverside, California",1262,1537,993.84529999999995,0.3337,3.1800000000000002E-2,35.868400000000001,0.15339,0.13406000000000001,0.10491,36.6,95.4,1819,1599,7.05]
["USA","California","Mcclellan AFB","Mcclellan AFB, California",1234,1841,993.84529999999995,0.3337,3.1800000000000002E-2,35.868400000000001,0.15339,0.13406000000000001,0.10491,34.4,95.9,2347,1589,7.05]
["USA","California","Modesto City","Modesto City, California",1233,1874,993.84529999999995,0.3337,3.1800000000000002E-2,35.868400000000001,0.15339,0.13406000000000001,0.10491,33.6,95.4,2452,1562,7.05]
["USA","California","Monterey Peninsula","Monterey Peninsula, California",196,3006,993.84529999999995,0.3337,3.1800000000000002E-2,35.868400000000001,0.15339,0.13406000000000001,0.10491,38.700000000000003,70.400000000000006,3294,44,7.05]
["USA","California","Mountain View Moffett NAS","Mountain View Moffett NAS, California",738,1957,993.84529999999995,0.3337,3.1800000000000002E-2,35.868400000000001,0.15339,0.13406000000000001,0.10491,38.6,80.599999999999994,2153,480,7.05]
["USA","California","Napa Co. Airport","Napa Co. Airport, California",335,2359,993.84529999999995,0.3337,3.1800000000000002E-2,35.868400000000001,0.15339,0.13406000000000001,0.10491,32.5,82.1,3194,239,7.05]
["USA","California","Norton AFB / San Bernardino","Norton AFB / San Bernardino, California",1341,1391,993.84529999999995,0.3337,3.1800000000000002E-2,35.868400000000001,0.15339,0.13406000000000001,0.10491,36.5,97.4,1652,1811,7.05]
["USA","California","Oakland","Oakland, California",395,2432,993.84529999999995,0.3337,3.1800000000000002E-2,35.868400000000001,0.15339,0.13406000000000001,0.10491,39.5,74.3,2584,153,7.05]
["USA","California","Ontario","Ontario, California",1383,1343,993.84529999999995,0.3337,3.1800000000000002E-2,35.868400000000001,0.15339,0.13406000000000001,0.10491,38.9,94.7,1460,1711,7.05]
["USA","California","Palm Springs","Palm Springs, California",2404,915,993.84529999999995,0.3337,3.1800000000000002E-2,35.868400000000001,0.15339,0.13406000000000001,0.10491,44.7,107.8,774,4287,7.05]
["USA","California","Point Arguello","Point Arguello, California",1680,4563,993.84529999999995,0.3337,3.1800000000000002E-2,35.868400000000001,0.15339,0.13406000000000001,0.10491,47.6,65.3,3308,21,7.05]
["USA","California","Point Mugu","Point Mugu, California",572,1931,993.84529999999995,0.3337,3.1800000000000002E-2,35.868400000000001,0.15339,0.13406000000000001,0.10491,41.2,75.900000000000006,1915,260,7.05]
["USA","California","Porterville","Porterville, California",1244,1942,993.84529999999995,0.3337,3.1800000000000002E-2,35.868400000000001,0.15339,0.13406000000000001,0.10491,33.6,96.9,2541,1654,7.05]
["USA","California","Redding","Redding, California",1315,1905,993.84529999999995,0.3337,3.1800000000000002E-2,35.868400000000001,0.15339,0.13406000000000001,0.10491,30.8,99.3,2715,1880,7.05]
["USA","California","Riverside","Riverside, California",1261,1400,993.84529999999995,0.3337,3.1800000000000002E-2,35.868400000000001,0.15339,0.13406000000000001,0.10491,37.200000000000003,94.5,1622,1550,7.05]
["USA","California","Sacramento Executive Airport","Sacramento Executive Airport, California",1010,1953,993.84529999999995,0.3337,3.1800000000000002E-2,35.868400000000001,0.15339,0.13406000000000001,0.10491,33.799999999999997,93.8,2539,1212,7.05]
["USA","California","Sacramento Mather Airport","Sacramento Mather Airport, California",1008,1981,993.84529999999995,0.3337,3.1800000000000002E-2,35.868400000000001,0.15339,0.13406000000000001,0.10491,32.299999999999997,94.8,2699,1251,7.05]
["USA","California","Sacramento Metropolitan Airport","Sacramento Metropolitan Airport, California",1134,1850,993.84529999999995,0.3337,3.1800000000000002E-2,35.868400000000001,0.15339,0.13406000000000001,0.10491,34,94.8,2389,1408,7.05]
["USA","California","Salinas","Salinas, California",274,2267,993.84529999999995,0.3337,3.1800000000000002E-2,35.868400000000001,0.15339,0.13406000000000001,0.10491,36.200000000000003,75,2720,114,7.05]
["USA","California","San Diego Lindbergh Field","San Diego Lindbergh Field, California",1333,1473,993.84529999999995,0.3337,3.1800000000000002E-2,35.868400000000001,0.15339,0.13406000000000001,0.10491,46.8,78.7,1117,761,7.05]
["USA","California","San Diego Miramar NAS","San Diego Miramar NAS, California",1108,1467,993.84529999999995,0.3337,3.1800000000000002E-2,35.868400000000001,0.15339,0.13406000000000001,0.10491,41.4,83.8,1443,868,7.05]
["USA","California","San Diego North Island NAS","San Diego North Island NAS, California",1305,1549,993.84529999999995,0.3337,3.1800000000000002E-2,35.868400000000001,0.15339,0.13406000000000001,0.10491,46,77.3,1226,669,7.05]
["USA","California","San Diego / Brown Field","San Diego / Brown Field, California",919,1784,993.84529999999995,0.3337,3.1800000000000002E-2,35.868400000000001,0.15339,0.13406000000000001,0.10491,42.6,81.5,1665,632,7.05]
["USA","California","San Diego / Montgomery","San Diego / Montgomery, California",1131,1633,993.84529999999995,0.3337,3.1800000000000002E-2,35.868400000000001,0.15339,0.13406000000000001,0.10491,43.1,81.7,1490,787,7.05]
["USA","California","San Francisco Int'l Airport","San Francisco Int'l Airport, California",363,2686,993.84529999999995,0.3337,3.1800000000000002E-2,35.868400000000001,0.15339,0.13406000000000001,0.10491,40.799999999999997,74.400000000000006,2708,142,7.05]
["USA","California","San Jose","San Jose, California",869,1794,993.84529999999995,0.3337,3.1800000000000002E-2,35.868400000000001,0.15339,0.13406000000000001,0.10491,37.799999999999997,84.8,2033,717,7.05]
["USA","California","San Luis Obispo","San Luis Obispo, California",411,1841,993.84529999999995,0.3337,3.1800000000000002E-2,35.868400000000001,0.15339,0.13406000000000001,0.10491,36.299999999999997,81.099999999999994,2202,276,7.05]
["USA","California","Santa Barbara","Santa Barbara, California",438,1880,993.84529999999995,0.3337,3.1800000000000002E-2,35.868400000000001,0.15339,0.13406000000000001,0.10491,36.799999999999997,77,2209,219,7.05]
["USA","California","Santa Maria","Santa Maria, California",238,2163,993.84529999999995,0.3337,3.1800000000000002E-2,35.868400000000001,0.15339,0.13406000000000001,0.10491,34.700000000000003,76.7,2731,116,7.05]
["USA","California","Santa Rosa","Santa Rosa, California",402,2172,993.84529999999995,0.3337,3.1800000000000002E-2,35.868400000000001,0.15339,0.13406000000000001,0.10491,31.8,87.5,3005,377,7.05]
["USA","California","Stockton","Stockton, California",1113,1861,993.84529999999995,0.3337,3.1800000000000002E-2,35.868400000000001,0.15339,0.13406000000000001,0.10491,32.700000000000003,94.9,2505,1386,7.05]
["USA","California","Travis AFB / Fairfield","Travis AFB / Fairfield, California",909,1958,993.84529999999995,0.3337,3.1800000000000002E-2,35.868400000000001,0.15339,0.13406000000000001,0.10491,34.4,91,2496,985,7.05]
["USA","California","Truckee - Tahoe","Truckee - Tahoe, California",80,3164,993.84529999999995,0.3337,3.1800000000000002E-2,35.868400000000001,0.15339,0.13406000000000001,0.10491,7,82.4,7646,58,7.05]
["USA","California","Tustin","Tustin, California",1349,1086,993.84529999999995,0.3337,3.1800000000000002E-2,35.868400000000001,0.15339,0.13406000000000001,0.10491,41.1,86.8,1081,1225,7.05]
["USA","California","Visalia","Visalia, California",1238,1898,993.84529999999995,0.3337,3.1800000000000002E-2,35.868400000000001,0.15339,0.13406000000000001,0.10491,32.700000000000003,95.2,2555,1558,7.05]
["USA","Colorado","Akron","Akron, Colorado",755,2371,1730.9221,2.5133000000000001,1.7762,23.360299999999999,0.11459,9.393E-2,6.9459999999999994E-2,2.9,88.4,6134,736,7.58]
["USA","Colorado","Alamosa","Alamosa, Colorado",79,2721,1730.9221,2.5133000000000001,1.7762,23.360299999999999,0.11459,9.393E-2,6.9459999999999994E-2,-9.9,80.400000000000006,8493,51,7.58]
["USA","Colorado","Aspen","Aspen, Colorado",112,3139,1730.9221,2.5133000000000001,1.7762,23.360299999999999,0.11459,9.393E-2,6.9459999999999994E-2,1,80.7,8371,73,7.58]
["USA","Colorado","Buckley Air National Guard / Denver","Buckley Air National Guard / Denver, Colorado",721,2429,1730.9221,2.5133000000000001,1.7762,23.360299999999999,0.11459,9.393E-2,6.9459999999999994E-2,6.5,87.8,5920,685,7.58]
["USA","Colorado","Colorado Springs","Colorado Springs, Colorado",531,2546,1730.9221,2.5133000000000001,1.7762,23.360299999999999,0.11459,9.393E-2,6.9459999999999994E-2,5.8,84.9,6279,440,7.58]
["USA","Colorado","Cortez / Montezuma","Cortez / Montezuma, Colorado",459,2662,1730.9221,2.5133000000000001,1.7762,23.360299999999999,0.11459,9.393E-2,6.9459999999999994E-2,9,89.7,6212,472,7.58]
["USA","Colorado","Craig - Moffat","Craig - Moffat, Colorado",155,2828,1730.9221,2.5133000000000001,1.7762,23.360299999999999,0.11459,9.393E-2,6.9459999999999994E-2,-9,84.1,8719,123,7.58]
["USA","Colorado","Denver Int'l Airport","Denver Int'l Airport, Colorado",771,2455,1730.9221,2.5133000000000001,1.7762,23.360299999999999,0.11459,9.393E-2,6.9459999999999994E-2,6.9,89.2,5942,777,7.58]
["USA","Colorado","Denver Stapleton Airport","Denver Stapleton Airport, Colorado",738,2298,1730.9221,2.5133000000000001,1.7762,23.360299999999999,0.11459,9.393E-2,6.9459999999999994E-2,3.3,88,5908,707,7.58]
["USA","Colorado","Denver / Centennial","Denver / Centennial, Colorado",633,2450,1730.9221,2.5133000000000001,1.7762,23.360299999999999,0.11459,9.393E-2,6.9459999999999994E-2,4.2,86.3,6207,562,7.58]
["USA","Colorado","Durango / La Plata","Durango / La Plata, Colorado",366,2819,1730.9221,2.5133000000000001,1.7762,23.360299999999999,0.11459,9.393E-2,6.9459999999999994E-2,7.3,84.4,6778,296,7.58]
["USA","Colorado","Eagle County Airport","Eagle County Airport, Colorado",156,2869,1730.9221,2.5133000000000001,1.7762,23.360299999999999,0.11459,9.393E-2,6.9459999999999994E-2,-2.1,82.5,8021,114,7.58]
["USA","Colorado","Fort Collins","Fort Collins, Colorado",630,2544,1730.9221,2.5133000000000001,1.7762,23.360299999999999,0.11459,9.393E-2,6.9459999999999994E-2,6.4,88.2,6212,609,7.58]
["USA","Colorado","Grand Junction","Grand Junction, Colorado",1055,2418,1730.9221,2.5133000000000001,1.7762,23.360299999999999,0.11459,9.393E-2,6.9459999999999994E-2,11.7,92.3,5369,1200,7.58]
["USA","Colorado","Greeley / Weld","Greeley / Weld, Colorado",593,2441,1730.9221,2.5133000000000001,1.7762,23.360299999999999,0.11459,9.393E-2,6.9459999999999994E-2,1,89.8,6510,613,7.58]
["USA","Colorado","Gunnison","Gunnison, Colorado",28,3047,1730.9221,2.5133000000000001,1.7762,23.360299999999999,0.11459,9.393E-2,6.9459999999999994E-2,-11.1,78.5,9662,16,7.58]
["USA","Colorado","Hayden / Yampa",{"$f":"C130&\", \"&B130","v":"Hayden / Yampa, Colorado"},270,3053,1730.9221,2.5133000000000001,1.7762,23.360299999999999,0.11459,9.393E-2,6.9459999999999994E-2,1,81.8,8142,189,7.58]
["USA","Colorado","La Junta","La Junta, Colorado",1031,2135,1730.9221,2.5133000000000001,1.7762,23.360299999999999,0.11459,9.393E-2,6.9459999999999994E-2,7.1,94.4,5150,1263,7.58]
["USA","Colorado","Lamar","Lamar, Colorado",988,2247,1730.9221,2.5133000000000001,1.7762,23.360299999999999,0.11459,9.393E-2,6.9459999999999994E-2,8.6999999999999993,94.8,5270,1227,7.58]
["USA","Colorado","Limon","Limon, Colorado",452,2547,1730.9221,2.5133000000000001,1.7762,23.360299999999999,0.11459,9.393E-2,6.9459999999999994E-2,1.3,86.3,6760,401,7.58]
["USA","Colorado","Montrose","Montrose, Colorado",641,2589,1730.9221,2.5133000000000001,1.7762,23.360299999999999,0.11459,9.393E-2,6.9459999999999994E-2,9.9,89.6,5945,657,7.58]
["USA","Colorado","Pueblo","Pueblo, Colorado",799,2209,1730.9221,2.5133000000000001,1.7762,23.360299999999999,0.11459,9.393E-2,6.9459999999999994E-2,5.3,93,5496,932,7.58]
["USA","Colorado","Rifle","Rifle, Colorado",535,2655,1730.9221,2.5133000000000001,1.7762,23.360299999999999,0.11459,9.393E-2,6.9459999999999994E-2,7.5,90.3,6362,564,7.58]
["USA","Colorado","Trinidad","Trinidad, Colorado",777,2262,1730.9221,2.5133000000000001,1.7762,23.360299999999999,0.11459,9.393E-2,6.9459999999999994E-2,7.8,88.2,5392,751,7.58]
["USA","Connecticut","Bridgeport","Bridgeport, Connecticut",1149,2560,1291.1010000000001,0.74199999999999999,0.82469999999999999,81.434299999999993,0.17343,0.14652000000000001,0.12673000000000001,15.4,82,5290,814,8.4]
["USA","Connecticut","Hartford Bradley Int'l Airport","Hartford Bradley Int'l Airport, Connecticut",869,2523,1291.1010000000001,0.74199999999999999,0.82469999999999999,81.434299999999993,0.17343,0.14652000000000001,0.12673000000000001,8,85.4,5992,739,8.4]
["USA","Connecticut","Hartford Brainard Airport","Hartford Brainard Airport, Connecticut",1009,2480,1291.1010000000001,0.74199999999999999,0.82469999999999999,81.434299999999993,0.17343,0.14652000000000001,0.12673000000000001,10.6,84.4,5622,816,8.4]
["USA","Connecticut","Oxford","Oxford, Connecticut",679,2732,1291.1010000000001,0.74199999999999999,0.82469999999999999,81.434299999999993,0.17343,0.14652000000000001,0.12673000000000001,8.6999999999999993,81.3,6408,461,8.4]
["USA","Connecticut","Willimantic","Willimantic, Connecticut",769,2588,1291.1010000000001,0.74199999999999999,0.82469999999999999,81.434299999999993,0.17343,0.14652000000000001,0.12673000000000001,9.1,83.6,6029,596,8.4]
["USA","Delaware","Dover AFB","Dover AFB, Delaware",1289,2316,1780.8382999999999,1.9717,6.6148999999999996,26.837499999999999,0.1358,0.1013,8.3570000000000005E-2,18.2,86.9,4517,1176,13.31]
["USA","Delaware","Georgetown / Sussex","Georgetown / Sussex, Delaware",1263,2209,1780.8382999999999,1.9717,6.6148999999999996,26.837499999999999,0.1358,0.1013,8.3570000000000005E-2,19.100000000000001,88,4224,1210,13.31]
["USA","Delaware","Wilmington","Wilmington, Delaware",1240,2349,1780.8382999999999,1.9717,6.6148999999999996,26.837499999999999,0.1358,0.1013,8.3570000000000005E-2,16.100000000000001,86.7,4786,1121,13.31]
["USA","Florida","Apalachicola","Apalachicola, Florida",2554,1029,1324.4760000000001,1.1273,2.1572,36.256100000000004,0.11422,9.6640000000000004E-2,8.0350000000000005E-2,35.700000000000003,89.1,1256,2565,10.41]
["USA","Florida","Cape San Blas","Cape San Blas, Florida",2669,1389,1324.4760000000001,1.1273,2.1572,36.256100000000004,0.11422,9.6640000000000004E-2,8.0350000000000005E-2,40,85.1,1447,2235,10.41]
["USA","Florida","Cecil Field","Cecil Field, Florida",2456,888,1324.4760000000001,1.1273,2.1572,36.256100000000004,0.11422,9.6640000000000004E-2,8.0350000000000005E-2,33.5,92.6,1166,2824,10.41]
["USA","Florida","Crestview","Crestview, Florida",2126,1192,1324.4760000000001,1.1273,2.1572,36.256100000000004,0.11422,9.6640000000000004E-2,8.0350000000000005E-2,27.5,91.1,1863,2312,10.41]
["USA","Florida","Cross City","Cross City, Florida",2457,900,1324.4760000000001,1.1273,2.1572,36.256100000000004,0.11422,9.6640000000000004E-2,8.0350000000000005E-2,30.8,90.7,1283,2631,10.41]
["USA","Florida","Daytona Beach","Daytona Beach, Florida",2902,707,1324.4760000000001,1.1273,2.1572,36.256100000000004,0.11422,9.6640000000000004E-2,8.0350000000000005E-2,38.799999999999997,89.2,772,2926,10.41]
["USA","Florida","Destin / Ft. Walton","Destin / Ft. Walton, Florida",2776,1092,1324.4760000000001,1.1273,2.1572,36.256100000000004,0.11422,9.6640000000000004E-2,8.0350000000000005E-2,36.9,88.5,1279,2718,10.41]
["USA","Florida","Eglin AFB / Valparaiso","Eglin AFB / Valparaiso, Florida",2468,1114,1324.4760000000001,1.1273,2.1572,36.256100000000004,0.11422,9.6640000000000004E-2,8.0350000000000005E-2,32.5,89.7,1508,2540,10.41]
["USA","Florida","Fort Lauderdale / Hollywood","Fort Lauderdale / Hollywood, Florida",4365,245,1324.4760000000001,1.1273,2.1572,36.256100000000004,0.11422,9.6640000000000004E-2,8.0350000000000005E-2,51.1,89.8,142,4510,10.41]
["USA","Florida","Fort Myers","Fort Myers, Florida",3566,352,1324.4760000000001,1.1273,2.1572,36.256100000000004,0.11422,9.6640000000000004E-2,8.0350000000000005E-2,46.3,91.3,274,3908,10.41]
["USA","Florida","Gainesville","Gainesville, Florida",2485,880,1324.4760000000001,1.1273,2.1572,36.256100000000004,0.11422,9.6640000000000004E-2,8.0350000000000005E-2,33.4,90.5,1159,2640,10.41]
["USA","Florida","Homestead AFB","Homestead AFB, Florida",4153,237,1324.4760000000001,1.1273,2.1572,36.256100000000004,0.11422,9.6640000000000004E-2,8.0350000000000005E-2,50.4,89.5,144,4240,10.41]
["USA","Florida","Jacksonville Int'l Airport","Jacksonville Int'l Airport, Florida",2432,972,1324.4760000000001,1.1273,2.1572,36.256100000000004,0.11422,9.6640000000000004E-2,8.0350000000000005E-2,32.5,90.9,1316,2624,10.41]
["USA","Florida","Jacksonville Cecil Field NAS","Jacksonville Cecil Field NAS, Florida",2795,847,1324.4760000000001,1.1273,2.1572,36.256100000000004,0.11422,9.6640000000000004E-2,8.0350000000000005E-2,36.299999999999997,91.5,1013,3086,10.41]
["USA","Florida","Jacksonville Executive Airport","Jacksonville Executive Airport, Florida",2467,1005,1324.4760000000001,1.1273,2.1572,36.256100000000004,0.11422,9.6640000000000004E-2,8.0350000000000005E-2,35.4,90,1240,2570,10.41]
["USA","Florida","Key West","Key West, Florida",4804,206,1324.4760000000001,1.1273,2.1572,36.256100000000004,0.11422,9.6640000000000004E-2,8.0350000000000005E-2,57.9,89,61,4804,10.41]
["USA","Florida","Macdill AFB / Tampa","Macdill AFB / Tampa, Florida",3403,555,1324.4760000000001,1.1273,2.1572,36.256100000000004,0.11422,9.6640000000000004E-2,8.0350000000000005E-2,44.3,90.7,479,3644,10.41]
["USA","Florida","Marathon","Marathon, Florida",4772,209,1324.4760000000001,1.1273,2.1572,36.256100000000004,0.11422,9.6640000000000004E-2,8.0350000000000005E-2,56.6,90.4,73,5050,10.41]
["USA","Florida","Mayport","Mayport, Florida",2874,920,1324.4760000000001,1.1273,2.1572,36.256100000000004,0.11422,9.6640000000000004E-2,8.0350000000000005E-2,38.6,90.3,1012,3030,10.41]
["USA","Florida","Melbourne","Melbourne, Florida",3416,500,1324.4760000000001,1.1273,2.1572,36.256100000000004,0.11422,9.6640000000000004E-2,8.0350000000000005E-2,43.4,89.7,450,3516,10.41]
["USA","Florida","Miami","Miami, Florida",4332,235,1324.4760000000001,1.1273,2.1572,36.256100000000004,0.11422,9.6640000000000004E-2,8.0350000000000005E-2,51.7,89.7,130,4458,10.41]
["USA","Florida","Miami / Kendall-Tamia","Miami / Kendall-Tamia, Florida",3872,258,1324.4760000000001,1.1273,2.1572,36.256100000000004,0.11422,9.6640000000000004E-2,8.0350000000000005E-2,49,90.3,172,4082,10.41]
["USA","Florida","Naples","Naples, Florida",3640,380,1324.4760000000001,1.1273,2.1572,36.256100000000004,0.11422,9.6640000000000004E-2,8.0350000000000005E-2,47.4,89.3,279,3686,10.41]
["USA","Florida","NASA Shuttle Facility","NASA Shuttle Facility, Florida",3124,586,1324.4760000000001,1.1273,2.1572,36.256100000000004,0.11422,9.6640000000000004E-2,8.0350000000000005E-2,42.4,89.2,552,3150,10.41]
["USA","Florida","Ocala","Ocala, Florida",2573,801,1324.4760000000001,1.1273,2.1572,36.256100000000004,0.11422,9.6640000000000004E-2,8.0350000000000005E-2,34,90.6,1035,2745,10.41]
["USA","Florida","Orlando Executive Airport","Orlando Executive Airport, Florida",3277,550,1324.4760000000001,1.1273,2.1572,36.256100000000004,0.11422,9.6640000000000004E-2,8.0350000000000005E-2,44.2,91.1,477,3564,10.41]
["USA","Florida","Orlando Int'l Airport","Orlando Int'l Airport, Florida",3107,565,1324.4760000000001,1.1273,2.1572,36.256100000000004,0.11422,9.6640000000000004E-2,8.0350000000000005E-2,41.9,91.1,544,3379,10.41]
["USA","Florida","Orlando Sanford Airport","Orlando Sanford Airport, Florida",2985,650,1324.4760000000001,1.1273,2.1572,36.256100000000004,0.11422,9.6640000000000004E-2,8.0350000000000005E-2,42.3,91.2,615,3259,10.41]
["USA","Florida","Panama City Bay","Panama City Bay, Florida",2712,996,1324.4760000000001,1.1273,2.1572,36.256100000000004,0.11422,9.6640000000000004E-2,8.0350000000000005E-2,36,90.2,1203,2848,10.41]
["USA","Florida","Pensacola / Forrest Sherman NAS","Pensacola / Forrest Sherman NAS, Florida",2499,1089,1324.4760000000001,1.1273,2.1572,36.256100000000004,0.11422,9.6640000000000004E-2,8.0350000000000005E-2,32.200000000000003,90.1,1488,2614,10.41]
["USA","Florida","Pensacola","Pensacola, Florida",2523,1113,1324.4760000000001,1.1273,2.1572,36.256100000000004,0.11422,9.6640000000000004E-2,8.0350000000000005E-2,33.299999999999997,90,1470,2628,10.41]
["USA","Florida","Sarasota","Sarasota, Florida",3245,509,1324.4760000000001,1.1273,2.1572,36.256100000000004,0.11422,9.6640000000000004E-2,8.0350000000000005E-2,43.8,90.3,450,3421,10.41]
["USA","Florida","Sombrero Key","Sombrero Key, Florida",5207,183,1324.4760000000001,1.1273,2.1572,36.256100000000004,0.11422,9.6640000000000004E-2,8.0350000000000005E-2,59.1,86.4,45,4643,10.41]
["USA","Florida","St Augsutine","St Augsutine, Florida",2731,948,1324.4760000000001,1.1273,2.1572,36.256100000000004,0.11422,9.6640000000000004E-2,8.0350000000000005E-2,36.9,88.5,1110,2674,10.41]
["USA","Florida","St. Petersburg / Clearwater Airport","St. Petersburg / Clearwater Airport, Florida",3565,531,1324.4760000000001,1.1273,2.1572,36.256100000000004,0.11422,9.6640000000000004E-2,8.0350000000000005E-2,45.8,90.5,425,3788,10.41]
["USA","Florida","Tallahassee","Tallahassee, Florida",2287,1020,1324.4760000000001,1.1273,2.1572,36.256100000000004,0.11422,9.6640000000000004E-2,8.0350000000000005E-2,28.9,91.9,1534,2563,10.41]
["USA","Florida","Tampa","Tampa, Florida",3336,563,1324.4760000000001,1.1273,2.1572,36.256100000000004,0.11422,9.6640000000000004E-2,8.0350000000000005E-2,42.5,90.3,528,3517,10.41]
["USA","Florida","Tyndall AFB","Tyndall AFB, Florida",2691,1052,1324.4760000000001,1.1273,2.1572,36.256100000000004,0.11422,9.6640000000000004E-2,8.0350000000000005E-2,36.1,88.6,1267,2646,10.41]
["USA","Florida","Venice Pier","Venice Pier, Florida",3375,604,1324.4760000000001,1.1273,2.1572,36.256100000000004,0.11422,9.6640000000000004E-2,8.0350000000000005E-2,46.2,85.9,473,2939,10.41]
["USA","Florida","Vero Beach","Vero Beach, Florida",3394,456,1324.4760000000001,1.1273,2.1572,36.256100000000004,0.11422,9.6640000000000004E-2,8.0350000000000005E-2,43.1,89.5,416,3465,10.41]
["USA","Florida","West Palm","West Palm, Florida",4011,313,1324.4760000000001,1.1273,2.1572,36.256100000000004,0.11422,9.6640000000000004E-2,8.0350000000000005E-2,48.3,89.2,218,4044,10.41]
["USA","Florida","Whiting Field Naas","Whiting Field Naas, Florida",2322,1130,1324.4760000000001,1.1273,2.1572,36.256100000000004,0.11422,9.6640000000000004E-2,8.0350000000000005E-2,31.1,91.2,1596,2535,10.41]
["USA","Georgia","Albany","Albany, Georgia",2183,1199,1650.9891,1.5394000000000001,6.5791000000000004,25.739000000000001,0.11175,9.5780000000000004E-2,5.9769999999999997E-2,29.7,92.6,1763,2510,9.74]
["USA","Georgia","Athens","Athens, Georgia",1690,1704,1650.9891,1.5394000000000001,6.5791000000000004,25.739000000000001,0.11175,9.5780000000000004E-2,5.9769999999999997E-2,26.1,90.4,2762,1789,9.74]
["USA","Georgia","Atlanta","Atlanta, Georgia",1445,1748,1650.9891,1.5394000000000001,6.5791000000000004,25.739000000000001,0.11175,9.5780000000000004E-2,5.9769999999999997E-2,23.2,89.6,3045,1481,9.74]
["USA","Georgia","Atlanta Hartsfield Int'l Airport","Atlanta Hartsfield Int'l Airport, Georgia",1818,1649,1650.9891,1.5394000000000001,6.5791000000000004,25.739000000000001,0.11175,9.5780000000000004E-2,5.9769999999999997E-2,25.8,89.3,2694,1841,9.74]
["USA","Georgia","Augusta","Augusta, Georgia",1807,1476,1650.9891,1.5394000000000001,6.5791000000000004,25.739000000000001,0.11175,9.5780000000000004E-2,5.9769999999999997E-2,25.8,92.4,2411,2063,9.74]
["USA","Georgia","Brunswick","Brunswick, Georgia",2574,1172,1650.9891,1.5394000000000001,6.5791000000000004,25.739000000000001,0.11175,9.5780000000000004E-2,5.9769999999999997E-2,33.799999999999997,88.4,1523,2510,9.74]
["USA","Georgia","Columbus",{"$f":"C194&\", \"&B194","v":"Columbus, Georgia"},2063,1377,1650.9891,1.5394000000000001,6.5791000000000004,25.739000000000001,0.11175,9.5780000000000004E-2,5.9769999999999997E-2,28.9,92.1,2071,2330,9.74]
["USA","Georgia","Dekalb Peachtree Airport","Dekalb Peachtree Airport, Georgia",1715,1757,1650.9891,1.5394000000000001,6.5791000000000004,25.739000000000001,0.11175,9.5780000000000004E-2,5.9769999999999997E-2,26.8,90.1,2797,1794,9.74]
["USA","Georgia","Dobbins AFB / Mariett","Dobbins AFB / Mariett, Georgia",1728,1735,1650.9891,1.5394000000000001,6.5791000000000004,25.739000000000001,0.11175,9.5780000000000004E-2,5.9769999999999997E-2,25,89,2892,1728,9.74]
["USA","Georgia","Columbus / Fort Benning","Columbus / Fort Benning, Georgia",1867,1409,1650.9891,1.5394000000000001,6.5791000000000004,25.739000000000001,0.11175,9.5780000000000004E-2,5.9769999999999997E-2,26.6,92.1,2254,2108,9.74]
["USA","Georgia","Fulton","Fulton, Georgia",1637,1718,1650.9891,1.5394000000000001,6.5791000000000004,25.739000000000001,0.11175,9.5780000000000004E-2,5.9769999999999997E-2,24.9,89.9,2871,1698,9.74]
["USA","Georgia","Gainesville","Gainesville, Georgia",1646,1879,1650.9891,1.5394000000000001,6.5791000000000004,25.739000000000001,0.11175,9.5780000000000004E-2,5.9769999999999997E-2,27.1,88.2,2968,1591,9.74]
["USA","Georgia","Hunter AAF","Hunter AAF, Georgia",2327,1188,1650.9891,1.5394000000000001,6.5791000000000004,25.739000000000001,0.11175,9.5780000000000004E-2,5.9769999999999997E-2,31.8,91.2,1644,2540,9.74]
["USA","Georgia","Macon","Macon, Georgia",1931,1423,1650.9891,1.5394000000000001,6.5791000000000004,25.739000000000001,0.11175,9.5780000000000004E-2,5.9769999999999997E-2,27.4,92.2,2229,2189,9.74]
["USA","Georgia","Moody AFB / Valdosta","Moody AFB / Valdosta, Georgia",2361,1075,1650.9891,1.5394000000000001,6.5791000000000004,25.739000000000001,0.11175,9.5780000000000004E-2,5.9769999999999997E-2,33.700000000000003,92.1,1402,2666,9.74]
["USA","Georgia","Rome","Rome, Georgia",1587,1737,1650.9891,1.5394000000000001,6.5791000000000004,25.739000000000001,0.11175,9.5780000000000004E-2,5.9769999999999997E-2,22.1,91.1,3104,1726,9.74]
["USA","Georgia","Savannah","Savannah, Georgia",2217,1223,1650.9891,1.5394000000000001,6.5791000000000004,25.739000000000001,0.11175,9.5780000000000004E-2,5.9769999999999997E-2,30.6,91.4,1753,2439,9.74]
["USA","Georgia","Valdosta","Valdosta, Georgia",2267,1062,1650.9891,1.5394000000000001,6.5791000000000004,25.739000000000001,0.11175,9.5780000000000004E-2,5.9769999999999997E-2,30.9,91.8,1509,2532,9.74]
["USA","Georgia","Warner Robins AFB","Warner Robins AFB, Georgia",1939,1392,1650.9891,1.5394000000000001,6.5791000000000004,25.739000000000001,0.11175,9.5780000000000004E-2,5.9769999999999997E-2,28.2,92.8,2135,2246,9.74]
["USA","Georgia","Waycross","Waycross, Georgia",2210,1138,1650.9891,1.5394000000000001,6.5791000000000004,25.739000000000001,0.11175,9.5780000000000004E-2,5.9769999999999997E-2,31.4,92.1,1593,2495,9.74]
["USA","Hawaii","Hilo","Hilo, Hawaii",4159,0,1619.7326,4.5641999999999996,4.3685,102.7129,0.37342999999999998,0.34882000000000002,0.30820999999999998,62.7,83.8,0,3258,47.03]
["USA","Hawaii","Honolulu","Honolulu, Hawaii",4809,0,1619.7326,4.5641999999999996,4.3685,102.7129,0.37342999999999998,0.34882000000000002,0.30820999999999998,63.3,88.2,0,4649,47.03]
["USA","Hawaii","Kahului","Kahului, Hawaii",4228,0,1619.7326,4.5641999999999996,4.3685,102.7129,0.37342999999999998,0.34882000000000002,0.30820999999999998,60.7,87.4,0,3946,47.03]
["USA","Hawaii","Kaneohe Bay","Kaneohe Bay, Hawaii",5545,0,1619.7326,4.5641999999999996,4.3685,102.7129,0.37342999999999998,0.34882000000000002,0.30820999999999998,66.2,83.6,0,4297,47.03]
["USA","Hawaii","Kona","Kona, Hawaii",5345,0,1619.7326,4.5641999999999996,4.3685,102.7129,0.37342999999999998,0.34882000000000002,0.30820999999999998,67.099999999999994,85.9,0,4655,47.03]
["USA","Hawaii","Lihue","Lihue, Hawaii",4978,0,1619.7326,4.5641999999999996,4.3685,102.7129,0.37342999999999998,0.34882000000000002,0.30820999999999998,62.3,83.9,0,3920,47.03]
["USA","Hawaii","Molokai","Molokai, Hawaii",4328,14,1619.7326,4.5641999999999996,4.3685,102.7129,0.37342999999999998,0.34882000000000002,0.30820999999999998,61.6,85.2,2,3643,47.03]
["USA","Idaho","Boise","Boise, Idaho",794,2492,754.85519999999997,0.56079999999999997,0.85660000000000003,47.009599999999999,8.6669999999999997E-2,6.8640000000000007E-2,5.4780000000000002E-2,10.5,91.9,5658,890,7.35]
["USA","Idaho","Burley","Burley, Idaho",532,2603,754.85519999999997,0.56079999999999997,0.85660000000000003,47.009599999999999,8.6669999999999997E-2,6.8640000000000007E-2,5.4780000000000002E-2,6.2,87.7,6377,503,7.35]
["USA","Idaho","Caldwell","Caldwell, Idaho",603,2814,754.85519999999997,0.56079999999999997,0.85660000000000003,47.009599999999999,8.6669999999999997E-2,6.8640000000000007E-2,5.4780000000000002E-2,16.399999999999999,90.4,5698,638,7.35]
["USA","Idaho","Challis","Challis, Idaho",324,2657,754.85519999999997,0.56079999999999997,0.85660000000000003,47.009599999999999,8.6669999999999997E-2,6.8640000000000007E-2,5.4780000000000002E-2,-6.1,85.6,7870,278,7.35]
["USA","Idaho","Coeur D`Alene","Coeur D`Alene, Idaho",358,3098,754.85519999999997,0.56079999999999997,0.85660000000000003,47.009599999999999,8.6669999999999997E-2,6.8640000000000007E-2,5.4780000000000002E-2,11.6,84.2,6892,286,7.35]
["USA","Idaho","Elk City","Elk City, Idaho",548,2806,754.85519999999997,0.56079999999999997,0.85660000000000003,47.009599999999999,8.6669999999999997E-2,6.8640000000000007E-2,5.4780000000000002E-2,16,86.5,5728,491,7.35]
["USA","Idaho","Idaho Falls","Idaho Falls, Idaho",310,2786,754.85519999999997,0.56079999999999997,0.85660000000000003,47.009599999999999,8.6669999999999997E-2,6.8640000000000007E-2,5.4780000000000002E-2,-2.4,86.3,7825,275,7.35]
["USA","Idaho","Joslin Field / Twin Falls","Joslin Field / Twin Falls, Idaho",683,2809,754.85519999999997,0.56079999999999997,0.85660000000000003,47.009599999999999,8.6669999999999997E-2,6.8640000000000007E-2,5.4780000000000002E-2,12.4,89.6,6157,700,7.35]
["USA","Idaho","Lewiston","Lewiston, Idaho",760,2589,754.85519999999997,0.56079999999999997,0.85660000000000003,47.009599999999999,8.6669999999999997E-2,6.8640000000000007E-2,5.4780000000000002E-2,17.5,90.7,5124,814,7.35]
["USA","Idaho","Mccall","Mccall, Idaho",67,3359,754.85519999999997,0.56079999999999997,0.85660000000000003,47.009599999999999,8.6669999999999997E-2,6.8640000000000007E-2,5.4780000000000002E-2,-1.7,80.8,9334,44,7.35]
["USA","Idaho","Mountain Home AFB","Mountain Home AFB, Idaho",722,2525,754.85519999999997,0.56079999999999997,0.85660000000000003,47.009599999999999,8.6669999999999997E-2,6.8640000000000007E-2,5.4780000000000002E-2,9,92.9,5892,839,7.35]
["USA","Idaho","Mullan","Mullan, Idaho",155,3155,754.85519999999997,0.56079999999999997,0.85660000000000003,47.009599999999999,8.6669999999999997E-2,6.8640000000000007E-2,5.4780000000000002E-2,7.6,80.900000000000006,7546,103,7.35]
["USA","Idaho","Pocatello","Pocatello, Idaho",432,2651,754.85519999999997,0.56079999999999997,0.85660000000000003,47.009599999999999,8.6669999999999997E-2,6.8640000000000007E-2,5.4780000000000002E-2,1.3,88.3,7035,419,7.35]
["USA","Idaho","Salmon","Salmon, Idaho",257,2987,754.85519999999997,0.56079999999999997,0.85660000000000003,47.009599999999999,8.6669999999999997E-2,6.8640000000000007E-2,5.4780000000000002E-2,0.6,83.4,8014,197,7.35]
["USA","Illinois","Aurora","Aurora, Illinois",824,2416,2113.7057,1.6017999999999999,4.8188000000000004,25.505099999999999,0.11375,7.9880000000000007E-2,5.7979999999999997E-2,1.4,85.7,6403,711,7.77]
["USA","Illinois","Chicago Midway Airport","Chicago Midway Airport, Illinois",1141,2345,2113.7057,1.6017999999999999,4.8188000000000004,25.505099999999999,0.11375,7.9880000000000007E-2,5.7979999999999997E-2,4.3,86.5,5930,1022,7.77]
["USA","Illinois","Chicago - Ohare Int'l Airport","Chicago - Ohare Int'l Airport, Illinois",958,2412,2113.7057,1.6017999999999999,4.8188000000000004,25.505099999999999,0.11375,7.9880000000000007E-2,5.7979999999999997E-2,2.2000000000000002,86.1,6311,842,7.77]
["USA","Illinois","Decatur","Decatur, Illinois",1102,2197,2113.7057,1.6017999999999999,4.8188000000000004,25.505099999999999,0.11375,7.9880000000000007E-2,5.7979999999999997E-2,4.5999999999999996,88.2,5529,1065,7.77]
["USA","Illinois","Glenview","Glenview, Illinois",998,2376,2113.7057,1.6017999999999999,4.8188000000000004,25.505099999999999,0.11375,7.9880000000000007E-2,5.7979999999999997E-2,2.1,86.7,6227,902,7.77]
["USA","Illinois","Lawrenceville","Lawrenceville, Illinois",1249,2119,2113.7057,1.6017999999999999,4.8188000000000004,25.505099999999999,0.11375,7.9880000000000007E-2,5.7979999999999997E-2,12.1,89.7,4670,1285,7.77]
["USA","Illinois","Marseilles Island","Marseilles Island, Illinois",954,2329,2113.7057,1.6017999999999999,4.8188000000000004,25.505099999999999,0.11375,7.9880000000000007E-2,5.7979999999999997E-2,-0.3,86.6,6337,859,7.77]
["USA","Illinois","Mattoon / Charleston","Mattoon / Charleston, Illinois",1156,2197,2113.7057,1.6017999999999999,4.8188000000000004,25.505099999999999,0.11375,7.9880000000000007E-2,5.7979999999999997E-2,9.3000000000000007,87.6,5098,1089,7.77]
["USA","Illinois","Moline","Moline, Illinois",1056,2267,2113.7057,1.6017999999999999,4.8188000000000004,25.505099999999999,0.11375,7.9880000000000007E-2,5.7979999999999997E-2,0,87.7,6141,999,7.77]
["USA","Illinois","Mount Vernon","Mount Vernon, Illinois",1199,2148,2113.7057,1.6017999999999999,4.8188000000000004,25.505099999999999,0.11375,7.9880000000000007E-2,5.7979999999999997E-2,10.9,89.8,4842,1239,7.77]
["USA","Illinois","Peoria","Peoria, Illinois",1109,2224,2113.7057,1.6017999999999999,4.8188000000000004,25.505099999999999,0.11375,7.9880000000000007E-2,5.7979999999999997E-2,2.2999999999999998,87.4,5809,1035,7.77]
["USA","Illinois","Quincy","Quincy, Illinois",1158,2160,2113.7057,1.6017999999999999,4.8188000000000004,25.505099999999999,0.11375,7.9880000000000007E-2,5.7979999999999997E-2,3.3,87.8,5552,1100,7.77]
["USA","Illinois","Rockford","Rockford, Illinois",899,2409,2113.7057,1.6017999999999999,4.8188000000000004,25.505099999999999,0.11375,7.9880000000000007E-2,5.7979999999999997E-2,-1.7,85.8,6694,779,7.77]
["USA","Illinois","Scott AFB / Belleville","Scott AFB / Belleville, Illinois",1349,2035,2113.7057,1.6017999999999999,4.8188000000000004,25.505099999999999,0.11375,7.9880000000000007E-2,5.7979999999999997E-2,10.3,90.4,4638,1428,7.77]
["USA","Illinois","Springfield","Springfield, Illinois",1179,2157,2113.7057,1.6017999999999999,4.8188000000000004,25.505099999999999,0.11375,7.9880000000000007E-2,5.7979999999999997E-2,4.5999999999999996,88.1,5429,1135,7.77]
["USA","Illinois","Sterling / Rockfalls","Sterling / Rockfalls, Illinois",885,2413,2113.7057,1.6017999999999999,4.8188000000000004,25.505099999999999,0.11375,7.9880000000000007E-2,5.7979999999999997E-2,0.4,85.2,6496,745,7.77]
["USA","Illinois","University Of Illinois","University Of Illinois, Illinois",1068,2240,2113.7057,1.6017999999999999,4.8188000000000004,25.505099999999999,0.11375,7.9880000000000007E-2,5.7979999999999997E-2,4.4000000000000004,87.7,5657,1010,7.77]
["USA","Illinois","West Chicago / Du Page","West Chicago / Du Page, Illinois",879,2426,2113.7057,1.6017999999999999,4.8188000000000004,25.505099999999999,0.11375,7.9880000000000007E-2,5.7979999999999997E-2,0.6,85.1,6511,736,7.77]
["USA","Indiana","Evansville","Evansville, Indiana",1381,2018,2094.8526999999999,2.1095999999999999,8.8841999999999999,24.7851,0.10526000000000001,9.1410000000000005E-2,6.3380000000000006E-2,12.1,89.5,4449,1410,7.68]
["USA","Indiana","Fort Wayne","Fort Wayne, Indiana",963,2357,2094.8526999999999,2.1095999999999999,8.8841999999999999,24.7851,0.10526000000000001,9.1410000000000005E-2,6.3380000000000006E-2,3.8,85.7,6011,831,7.68]
["USA","Indiana","Peru / Grissom Air Reserve","Peru / Grissom Air Reserve, Indiana",1134,2245,2094.8526999999999,2.1095999999999999,8.8841999999999999,24.7851,0.10526000000000001,9.1410000000000005E-2,6.3380000000000006E-2,3.4,86.7,5761,1025,7.68]
["USA","Indiana","Huntingburg","Huntingburg, Indiana",1222,2112,2094.8526999999999,2.1095999999999999,8.8841999999999999,24.7851,0.10526000000000001,9.1410000000000005E-2,6.3380000000000006E-2,13.9,87.9,4497,1166,7.68]
["USA","Indiana","Indianapolis","Indianapolis, Indiana",1189,2180,2094.8526999999999,2.1095999999999999,8.8841999999999999,24.7851,0.10526000000000001,9.1410000000000005E-2,6.3380000000000006E-2,6.4,86.3,5322,1055,7.68]
["USA","Indiana","Lafayette","Lafayette, Indiana",1070,2201,2094.8526999999999,2.1095999999999999,8.8841999999999999,24.7851,0.10526000000000001,9.1410000000000005E-2,6.3380000000000006E-2,4.2,87.5,5577,1003,7.68]
["USA","Indiana","Monroe","Monroe, Indiana",1076,2162,2094.8526999999999,2.1095999999999999,8.8841999999999999,24.7851,0.10526000000000001,9.1410000000000005E-2,6.3380000000000006E-2,10.199999999999999,87.5,4936,1009,7.68]
["USA","Indiana","South Bend","South Bend, Indiana",958,2455,2094.8526999999999,2.1095999999999999,8.8841999999999999,24.7851,0.10526000000000001,9.1410000000000005E-2,6.3380000000000006E-2,4.5,85.3,6188,810,7.68]
["USA","Indiana","Terre Haute","Terre Haute, Indiana",1142,2135,2094.8526999999999,2.1095999999999999,8.8841999999999999,24.7851,0.10526000000000001,9.1410000000000005E-2,6.3380000000000006E-2,6.6,87.8,5194,1085,7.68]
["USA","Iowa","Ames","Ames, Iowa",925,2377,2165.9283,2.5590000000000002,6.2724000000000002,25.868600000000001,0.10818999999999999,8.0070000000000002E-2,5.2949999999999997E-2,0.5,85.6,6388,794,7.13]
["USA","Iowa","Ankeny","Ankeny, Iowa",1095,2212,2165.9283,2.5590000000000002,6.2724000000000002,25.868600000000001,0.10818999999999999,8.0070000000000002E-2,5.2949999999999997E-2,0.4,88.3,5954,1063,7.13]
["USA","Iowa","Atlantic",{"$f":"C258&\", \"&B258","v":"Atlantic, Iowa"},1045,2334,2165.9283,2.5590000000000002,6.2724000000000002,25.868600000000001,0.10818999999999999,8.0070000000000002E-2,5.2949999999999997E-2,0.1,88.4,6312,1019,7.13]
["USA","Iowa","Boone","Boone, Iowa",1012,2351,2165.9283,2.5590000000000002,6.2724000000000002,25.868600000000001,0.10818999999999999,8.0070000000000002E-2,5.2949999999999997E-2,0.4,86.2,6328,894,7.13]
["USA","Iowa","Burlington","Burlington, Iowa",1166,2167,2165.9283,2.5590000000000002,6.2724000000000002,25.868600000000001,0.10818999999999999,8.0070000000000002E-2,5.2949999999999997E-2,1.3,87.8,5751,1108,7.13]
["USA","Iowa","Carroll","Carroll, Iowa",988,2347,2165.9283,2.5590000000000002,6.2724000000000002,25.868600000000001,0.10818999999999999,8.0070000000000002E-2,5.2949999999999997E-2,-0.3,88.3,6386,959,7.13]
["USA","Iowa","Cedar Rapids","Cedar Rapids, Iowa",936,2335,2165.9283,2.5590000000000002,6.2724000000000002,25.868600000000001,0.10818999999999999,8.0070000000000002E-2,5.2949999999999997E-2,-3.9,85.7,6703,807,7.13]
["USA","Iowa","Chariton","Chariton, Iowa",1123,2206,2165.9283,2.5590000000000002,6.2724000000000002,25.868600000000001,0.10818999999999999,8.0070000000000002E-2,5.2949999999999997E-2,3,88.1,5700,1081,7.13]
["USA","Iowa","Charles City","Charles City, Iowa",892,2456,2165.9283,2.5590000000000002,6.2724000000000002,25.868600000000001,0.10818999999999999,8.0070000000000002E-2,5.2949999999999997E-2,-3.2,84.4,6979,721,7.13]
["USA","Iowa","Clarion","Clarion, Iowa",920,2420,2165.9283,2.5590000000000002,6.2724000000000002,25.868600000000001,0.10818999999999999,8.0070000000000002E-2,5.2949999999999997E-2,-3.6,86.1,6918,809,7.13]
["USA","Iowa","Clinton","Clinton, Iowa",924,2404,2165.9283,2.5590000000000002,6.2724000000000002,25.868600000000001,0.10818999999999999,8.0070000000000002E-2,5.2949999999999997E-2,0.1,84.4,6501,747,7.13]
["USA","Iowa","Creston","Creston, Iowa",1053,2267,2165.9283,2.5590000000000002,6.2724000000000002,25.868600000000001,0.10818999999999999,8.0070000000000002E-2,5.2949999999999997E-2,0.6,88,6083,1009,7.13]
["USA","Iowa","Davenport","Davenport, Iowa",1000,2331,2165.9283,2.5590000000000002,6.2724000000000002,25.868600000000001,0.10818999999999999,8.0070000000000002E-2,5.2949999999999997E-2,1.3,84.4,6188,808,7.13]
["USA","Iowa","Des Moines","Des Moines, Iowa",1120,2249,2165.9283,2.5590000000000002,6.2724000000000002,25.868600000000001,0.10818999999999999,8.0070000000000002E-2,5.2949999999999997E-2,-1.6,87.3,6240,1041,7.13]
["USA","Iowa","Dubuque","Dubuque, Iowa",842,2481,2165.9283,2.5590000000000002,6.2724000000000002,25.868600000000001,0.10818999999999999,8.0070000000000002E-2,5.2949999999999997E-2,-2.6,83.5,6988,649,7.13]
["USA","Iowa","Estherville","Estherville, Iowa",795,2495,2165.9283,2.5590000000000002,6.2724000000000002,25.868600000000001,0.10818999999999999,8.0070000000000002E-2,5.2949999999999997E-2,-6,84.1,7381,633,7.13]
["USA","Iowa","Fairfield","Fairfield, Iowa",1071,2254,2165.9283,2.5590000000000002,6.2724000000000002,25.868600000000001,0.10818999999999999,8.0070000000000002E-2,5.2949999999999997E-2,2.6,89.6,5861,1098,7.13]
["USA","Iowa","Fort Dodge","Fort Dodge, Iowa",880,2420,2165.9283,2.5590000000000002,6.2724000000000002,25.868600000000001,0.10818999999999999,8.0070000000000002E-2,5.2949999999999997E-2,-6,85.6,7159,755,7.13]
["USA","Iowa","Keokuk","Keokuk, Iowa",1195,2229,2165.9283,2.5590000000000002,6.2724000000000002,25.868600000000001,0.10818999999999999,8.0070000000000002E-2,5.2949999999999997E-2,7.8,89.7,5313,1230,7.13]
["USA","Iowa","Marshall Town","Marshall Town, Iowa",929,2446,2165.9283,2.5590000000000002,6.2724000000000002,25.868600000000001,0.10818999999999999,8.0070000000000002E-2,5.2949999999999997E-2,-0.4,84.3,6665,747,7.13]
["USA","Iowa","Mason City","Mason City, Iowa",782,2493,2165.9283,2.5590000000000002,6.2724000000000002,25.868600000000001,0.10818999999999999,8.0070000000000002E-2,5.2949999999999997E-2,-8,84.9,7583,648,7.13]
["USA","Iowa","Ottumwa","Ottumwa, Iowa",1116,2237,2165.9283,2.5590000000000002,6.2724000000000002,25.868600000000001,0.10818999999999999,8.0070000000000002E-2,5.2949999999999997E-2,0.4,87.6,6021,1051,7.13]
["USA","Iowa","Sioux City","Sioux City, Iowa",974,2351,2165.9283,2.5590000000000002,6.2724000000000002,25.868600000000001,0.10818999999999999,8.0070000000000002E-2,5.2949999999999997E-2,-3.6,87.7,6721,921,7.13]
["USA","Iowa","Spencer","Spencer, Iowa",816,2443,2165.9283,2.5590000000000002,6.2724000000000002,25.868600000000001,0.10818999999999999,8.0070000000000002E-2,5.2949999999999997E-2,-8.3000000000000007,85.9,7462,711,7.13]
["USA","Iowa","Storm Lake","Storm Lake, Iowa",1017,2294,2165.9283,2.5590000000000002,6.2724000000000002,25.868600000000001,0.10818999999999999,8.0070000000000002E-2,5.2949999999999997E-2,-3.7,87.6,6567,958,7.13]
["USA","Iowa","Washington","Washington, Iowa",1069,2259,2165.9283,2.5590000000000002,6.2724000000000002,25.868600000000001,0.10818999999999999,8.0070000000000002E-2,5.2949999999999997E-2,3.2,89.5,5818,1091,7.13]
["USA","Iowa","Waterloo","Waterloo, Iowa",894,2367,2165.9283,2.5590000000000002,6.2724000000000002,25.868600000000001,0.10818999999999999,8.0070000000000002E-2,5.2949999999999997E-2,-6.3,86.1,7032,786,7.13]
["USA","Iowa","Webster City","Webster City, Iowa",1006,2403,2165.9283,2.5590000000000002,6.2724000000000002,25.868600000000001,0.10818999999999999,8.0070000000000002E-2,5.2949999999999997E-2,-0.2,88.1,6529,968,7.13]
["USA","Kansas","Chanute","Chanute, Kansas",1385,1984,2146.2235000000001,3.1316000000000002,3.7721,26.813800000000001,0.11243,9.2359999999999998E-2,7.0889999999999995E-2,11.7,91.4,4407,1524,8.82]
["USA","Kansas","Coffeyville","Coffeyville, Kansas",1506,1920,2146.2235000000001,3.1316000000000002,3.7721,26.813800000000001,0.11243,9.2359999999999998E-2,7.0889999999999995E-2,16.2,93.1,3903,1763,8.82]
["USA","Kansas","Concordia","Concordia, Kansas",1208,2129,2146.2235000000001,3.1316000000000002,3.7721,26.813800000000001,0.11243,9.2359999999999998E-2,7.0889999999999995E-2,4.7,92.6,5348,1389,8.82]
["USA","Kansas","Dodge City","Dodge City, Kansas",1196,2083,2146.2235000000001,3.1316000000000002,3.7721,26.813800000000001,0.11243,9.2359999999999998E-2,7.0889999999999995E-2,8.1,94.3,4939,1460,8.82]
["USA","Kansas","Elkhart","Elkhart, Kansas",1119,2029,2146.2235000000001,3.1316000000000002,3.7721,26.813800000000001,0.11243,9.2359999999999998E-2,7.0889999999999995E-2,12.3,94.6,4455,1380,8.82]
["USA","Kansas","Ft Riley / Marshall AAF","Ft Riley / Marshall AAF, Kansas",1292,2055,2146.2235000000001,3.1316000000000002,3.7721,26.813800000000001,0.11243,9.2359999999999998E-2,7.0889999999999995E-2,6,93.2,5051,1518,8.82]
["USA","Kansas","Garden City","Garden City, Kansas",1100,2100,2146.2235000000001,3.1316000000000002,3.7721,26.813800000000001,0.11243,9.2359999999999998E-2,7.0889999999999995E-2,6.3,93.3,5136,1297,8.82]
["USA","Kansas","Goodland","Goodland, Kansas",863,2315,2146.2235000000001,3.1316000000000002,3.7721,26.813800000000001,0.11243,9.2359999999999998E-2,7.0889999999999995E-2,4.4000000000000004,91.6,5846,957,8.82]
["USA","Kansas","Great Bend","Great Bend, Kansas",1235,2184,2146.2235000000001,3.1316000000000002,3.7721,26.813800000000001,0.11243,9.2359999999999998E-2,7.0889999999999995E-2,8.9,93.2,5104,1451,8.82]
["USA","Kansas","Hays","Hays, Kansas",1101,2244,2146.2235000000001,3.1316000000000002,3.7721,26.813800000000001,0.11243,9.2359999999999998E-2,7.0889999999999995E-2,7.3,94.7,5395,1363,8.82]
["USA","Kansas","Hill City","Hill City, Kansas",1111,2202,2146.2235000000001,3.1316000000000002,3.7721,26.813800000000001,0.11243,9.2359999999999998E-2,7.0889999999999995E-2,7.4,95.4,5284,1407,8.82]
["USA","Kansas","Lawrence","Lawrence, Kansas",1338,2091,2146.2235000000001,3.1316000000000002,3.7721,26.813800000000001,0.11243,9.2359999999999998E-2,7.0889999999999995E-2,9.9,91.3,4801,1466,8.82]
["USA","Kansas","Liberal","Liberal, Kansas",1157,2151,2146.2235000000001,3.1316000000000002,3.7721,26.813800000000001,0.11243,9.2359999999999998E-2,7.0889999999999995E-2,11.8,94.8,4769,1437,8.82]
["USA","Kansas","Manhattan","Manhattan, Kansas",1248,2170,2146.2235000000001,3.1316000000000002,3.7721,26.813800000000001,0.11243,9.2359999999999998E-2,7.0889999999999995E-2,8.8000000000000007,93,5081,1456,8.82]
["USA","Kansas","Mcconnell AFB","Mcconnell AFB, Kansas",1453,1954,2146.2235000000001,3.1316000000000002,3.7721,26.813800000000001,0.11243,9.2359999999999998E-2,7.0889999999999995E-2,11.6,93.5,4347,1726,8.82]
["USA","Kansas","Newton","Newton, Kansas",1258,2146,2146.2235000000001,3.1316000000000002,3.7721,26.813800000000001,0.11243,9.2359999999999998E-2,7.0889999999999995E-2,9.1,91.2,4998,1373,8.82]
["USA","Kansas","Olathe","Olathe, Kansas",1338,2034,2146.2235000000001,3.1316000000000002,3.7721,26.813800000000001,0.11243,9.2359999999999998E-2,7.0889999999999995E-2,9.8000000000000007,90.2,4678,1405,8.82]
["USA","Kansas","Parsons / Tri City","Parsons / Tri City, Kansas",1455,2012,2146.2235000000001,3.1316000000000002,3.7721,26.813800000000001,0.11243,9.2359999999999998E-2,7.0889999999999995E-2,15.5,92.6,4149,1673,8.82]
["USA","Kansas","Russell","Russell, Kansas",1214,2099,2146.2235000000001,3.1316000000000002,3.7721,26.813800000000001,0.11243,9.2359999999999998E-2,7.0889999999999995E-2,5.3,93.9,5221,1462,8.82]
["USA","Kansas","Salina","Salina, Kansas",1333,2020,2146.2235000000001,3.1316000000000002,3.7721,26.813800000000001,0.11243,9.2359999999999998E-2,7.0889999999999995E-2,7.4,94.9,4847,1661,8.82]
["USA","Kansas","Topeka Forbes Field","Topeka Forbes Field, Kansas",1257,2069,2146.2235000000001,3.1316000000000002,3.7721,26.813800000000001,0.11243,9.2359999999999998E-2,7.0889999999999995E-2,7.1,90.3,4992,1325,8.82]
["USA","Kansas","Topeka Municipal Airport","Topeka Municipal Airport, Kansas",1299,2051,2146.2235000000001,3.1316000000000002,3.7721,26.813800000000001,0.11243,9.2359999999999998E-2,7.0889999999999995E-2,6.7,91.2,4983,1418,8.82]
["USA","Kansas","Wichita Mid-Continent Airport","Wichita Mid-Continent Airport, Kansas",1389,2010,2146.2235000000001,3.1316000000000002,3.7721,26.813800000000001,0.11243,9.2359999999999998E-2,7.0889999999999995E-2,10.5,94,4564,1678,8.82]
["USA","Kansas","Wichita / Colonel Jabara Airport","Wichita / Colonel Jabara Airport, Kansas",1362,1993,2146.2235000000001,3.1316000000000002,3.7721,26.813800000000001,0.11243,9.2359999999999998E-2,7.0889999999999995E-2,11.5,92.8,4443,1578,8.82]
["USA","Kansas","Winfield / Arkansas City","Winfield / Arkansas City, Kansas",1515,1910,2146.2235000000001,3.1316000000000002,3.7721,26.813800000000001,0.11243,9.2359999999999998E-2,7.0889999999999995E-2,15.9,94.9,3908,1887,8.82]
["USA","Kentucky","Bowling Green","Bowling Green, Kentucky",1360,1990,2135.9917,1.9823999999999999,6.8800999999999997,25.224399999999999,9.4289999999999999E-2,8.7290000000000006E-2,5.3499999999999999E-2,15.1,88.8,4137,1349,8.2799999999999994]
["USA","Kentucky","Capital City","Capital City, Kentucky",1158,2215,2135.9917,1.9823999999999999,6.8800999999999997,25.224399999999999,9.4289999999999999E-2,8.7290000000000006E-2,5.3499999999999999E-2,15.7,87.8,4550,1100,8.2799999999999994]
["USA","Kentucky","Cincinnati","Cincinnati, Kentucky",1204,2187,2135.9917,1.9823999999999999,6.8800999999999997,25.224399999999999,9.4289999999999999E-2,8.7290000000000006E-2,5.3499999999999999E-2,10.3,86.5,4985,1079,8.2799999999999994]
["USA","Kentucky","Fort Campbell AAF","Fort Campbell AAF, Kentucky",1524,1870,2135.9917,1.9823999999999999,6.8800999999999997,25.224399999999999,9.4289999999999999E-2,8.7290000000000006E-2,5.3499999999999999E-2,16,90.2,3817,1600,8.2799999999999994]
["USA","Kentucky","Fort Knox / Godman","Fort Knox / Godman, Kentucky",1340,2028,2135.9917,1.9823999999999999,6.8800999999999997,25.224399999999999,9.4289999999999999E-2,8.7290000000000006E-2,5.3499999999999999E-2,13.8,88.2,4327,1295,8.2799999999999994]
["USA","Kentucky","Henderson City","Henderson City, Kentucky",1299,2117,2135.9917,1.9823999999999999,6.8800999999999997,25.224399999999999,9.4289999999999999E-2,8.7290000000000006E-2,5.3499999999999999E-2,14.9,89.8,4419,1342,8.2799999999999994]
["USA","Kentucky","Jackson","Jackson, Kentucky",1346,2012,2135.9917,1.9823999999999999,6.8800999999999997,25.224399999999999,9.4289999999999999E-2,8.7290000000000006E-2,5.3499999999999999E-2,14.8,85,4209,1122,8.2799999999999994]
["USA","Kentucky","Lexington","Lexington, Kentucky",1282,2098,2135.9917,1.9823999999999999,6.8800999999999997,25.224399999999999,9.4289999999999999E-2,8.7290000000000006E-2,5.3499999999999999E-2,12.7,87,4572,1175,8.2799999999999994]
["USA","Kentucky","London","London, Kentucky",1234,2067,2135.9917,1.9823999999999999,6.8800999999999997,25.224399999999999,9.4289999999999999E-2,8.7290000000000006E-2,5.3499999999999999E-2,15.6,86,4254,1080,8.2799999999999994]
["USA","Kentucky","Louisville Bowman Field","Louisville Bowman Field, Kentucky",1396,1988,2135.9917,1.9823999999999999,6.8800999999999997,25.224399999999999,9.4289999999999999E-2,8.7290000000000006E-2,5.3499999999999999E-2,13.6,88.9,4258,1390,8.2799999999999994]
["USA","Kentucky","Louisville Standiford Field","Louisville Standiford Field, Kentucky",1496,1981,2135.9917,1.9823999999999999,6.8800999999999997,25.224399999999999,9.4289999999999999E-2,8.7290000000000006E-2,5.3499999999999999E-2,14.5,89,4168,1496,8.2799999999999994]
["USA","Kentucky","Paducah","Paducah, Kentucky",1456,1934,2135.9917,1.9823999999999999,6.8800999999999997,25.224399999999999,9.4289999999999999E-2,8.7290000000000006E-2,5.3499999999999999E-2,14.5,90.3,4070,1535,8.2799999999999994]
["USA","Kentucky","Somerset","Somerset, Kentucky",1382,1957,2135.9917,1.9823999999999999,6.8800999999999997,25.224399999999999,9.4289999999999999E-2,8.7290000000000006E-2,5.3499999999999999E-2,18.600000000000001,90.3,3784,1457,8.2799999999999994]
["USA","Louisiana","Alexandria Esler Regional Airport",{"$f":"C322&\", \"&B322","v":"Alexandria Esler Regional Airport, Louisiana"},2082,1311,1316.9027000000001,1.5781000000000001,1.5642,26.895299999999999,8.3739999999999995E-2,7.7539999999999998E-2,4.759E-2,28.3,92.8,2005,2412,8.44]
["USA","Louisiana","Alexandria International Airport","Alexandria International Airport, Louisiana",2266,1248,1316.9027000000001,1.5781000000000001,1.5642,26.895299999999999,8.3739999999999995E-2,7.7539999999999998E-2,4.759E-2,29.7,92.2,1836,2568,8.44]
["USA","Louisiana","Bossier City / Barksdale AFB","Bossier City / Barksdale AFB, Louisiana",2004,1437,1316.9027000000001,1.5781000000000001,1.5642,26.895299999999999,8.3739999999999995E-2,7.7539999999999998E-2,4.759E-2,26.8,92.8,2287,2321,8.44]
["USA","Louisiana","Baton Rouge","Baton Rouge, Louisiana",2421,1140,1316.9027000000001,1.5781000000000001,1.5642,26.895299999999999,8.3739999999999995E-2,7.7539999999999998E-2,4.759E-2,31.1,91.3,1610,2653,8.44]
["USA","Louisiana","Grand Isle","Grand Isle, Louisiana",3303,974,1316.9027000000001,1.5781000000000001,1.5642,26.895299999999999,8.3739999999999995E-2,7.7539999999999998E-2,4.759E-2,40.5,86.4,994,2945,8.44]
["USA","Louisiana","Lafayette","Lafayette, Louisiana",2531,1101,1316.9027000000001,1.5781000000000001,1.5642,26.895299999999999,8.3739999999999995E-2,7.7539999999999998E-2,4.759E-2,32.4,91.2,1496,2763,8.44]
["USA","Louisiana","Lake Charles","Lake Charles, Louisiana",2557,1105,1316.9027000000001,1.5781000000000001,1.5642,26.895299999999999,8.3739999999999995E-2,7.7539999999999998E-2,4.759E-2,33.1,91,1469,2770,8.44]
["USA","Louisiana","Leesville / Fort Polk","Leesville / Fort Polk, Louisiana",2305,1225,1316.9027000000001,1.5781000000000001,1.5642,26.895299999999999,8.3739999999999995E-2,7.7539999999999998E-2,4.759E-2,30.1,92,1782,2593,8.44]
["USA","Louisiana","Monroe","Monroe, Louisiana",2091,1421,1316.9027000000001,1.5781000000000001,1.5642,26.895299999999999,8.3739999999999995E-2,7.7539999999999998E-2,4.759E-2,27.2,92.8,2238,2422,8.44]
["USA","Louisiana","New Orleans Int'l Airport","New Orleans Int'l Airport, Louisiana",2679,1069,1316.9027000000001,1.5781000000000001,1.5642,26.895299999999999,8.3739999999999995E-2,7.7539999999999998E-2,4.759E-2,35.4,90.5,1318,2846,8.44]
["USA","Louisiana","New Orleans Lakefront Airport","New Orleans Lakefront Airport, Louisiana",3000,1017,1316.9027000000001,1.5781000000000001,1.5642,26.895299999999999,8.3739999999999995E-2,7.7539999999999998E-2,4.759E-2,38.799999999999997,90.7,1110,3213,8.44]
["USA","Louisiana","Patterson","Patterson, Louisiana",2563,1100,1316.9027000000001,1.5781000000000001,1.5642,26.895299999999999,8.3739999999999995E-2,7.7539999999999998E-2,4.759E-2,35.5,90.3,1352,2702,8.44]
["USA","Louisiana","Salt Point","Salt Point, Louisiana",2739,1098,1316.9027000000001,1.5781000000000001,1.5642,26.895299999999999,8.3739999999999995E-2,7.7539999999999998E-2,4.759E-2,35.700000000000003,89.8,1341,2830,8.44]
["USA","Louisiana","Shreveport","Shreveport, Louisiana",2195,1428,1316.9027000000001,1.5781000000000001,1.5642,26.895299999999999,8.3739999999999995E-2,7.7539999999999998E-2,4.759E-2,29.8,94,2094,2652,8.44]
["USA","Louisiana","Shreveport Regional Airport","Shreveport Regional Airport, Louisiana",2107,1387,1316.9027000000001,1.5781000000000001,1.5642,26.895299999999999,8.3739999999999995E-2,7.7539999999999998E-2,4.759E-2,27.7,93.4,2156,2493,8.44]
["USA","Maine","Auburn-Lewiston","Auburn-Lewiston, Maine",458,2798,752.39880000000005,0.59530000000000005,1.0162,109.7345,0.14659,0.11527,7.9820000000000002E-2,-0.8,81.099999999999994,7672,307,12.22]
["USA","Maine","Augusta","Augusta, Maine",615,2757,752.39880000000005,0.59530000000000005,1.0162,109.7345,0.14659,0.11527,7.9820000000000002E-2,0.8,81,7375,410,12.22]
["USA","Maine","Bangor","Bangor, Maine",532,2740,752.39880000000005,0.59530000000000005,1.0162,109.7345,0.14659,0.11527,7.9820000000000002E-2,-2.2000000000000002,81.2,7673,359,12.22]
["USA","Maine","Bar Harbor","Bar Harbor, Maine",356,2873,752.39880000000005,0.59530000000000005,1.0162,109.7345,0.14659,0.11527,7.9820000000000002E-2,0.9,75.099999999999994,7673,150,12.22]
["USA","Maine","Brunswick NAS","Brunswick NAS, Maine",581,2732,752.39880000000005,0.59530000000000005,1.0162,109.7345,0.14659,0.11527,7.9820000000000002E-2,1.8,80.5,7194,375,12.22]
["USA","Maine","Caribou","Caribou, Maine",339,2993,752.39880000000005,0.59530000000000005,1.0162,109.7345,0.14659,0.11527,7.9820000000000002E-2,-10.199999999999999,78.099999999999994,9379,185,12.22]
["USA","Maine","Greenville","Greenville, Maine",384,2857,752.39880000000005,0.59530000000000005,1.0162,109.7345,0.14659,0.11527,7.9820000000000002E-2,-8.8000000000000007,77.3,8784,197,12.22]
["USA","Maine","Houlton","Houlton, Maine",347,2898,752.39880000000005,0.59530000000000005,1.0162,109.7345,0.14659,0.11527,7.9820000000000002E-2,-10.6,79.599999999999994,9130,211,12.22]
["USA","Maine","Loring AFB / Limeston","Loring AFB / Limeston, Maine",356,3051,752.39880000000005,0.59530000000000005,1.0162,109.7345,0.14659,0.11527,7.9820000000000002E-2,-10.1,77.599999999999994,9547,187,12.22]
["USA","Maine","Matinicus Rock","Matinicus Rock, Maine",0,3220,752.39880000000005,0.59530000000000005,1.0162,109.7345,0.14659,0.11527,7.9820000000000002E-2,9.4,64.7,7459,7,12.22]
["USA","Maine","Mount Desert Rock","Mount Desert Rock, Maine",0,3246,752.39880000000005,0.59530000000000005,1.0162,109.7345,0.14659,0.11527,7.9820000000000002E-2,9.3000000000000007,63.5,7533,1,12.22]
["USA","Maine","Northern Aroostook","Northern Aroostook, Maine",338,3133,752.39880000000005,0.59530000000000005,1.0162,109.7345,0.14659,0.11527,7.9820000000000002E-2,-9.1,75.3,9673,145,12.22]
["USA","Maine","Portland","Portland, Maine",569,2796,752.39880000000005,0.59530000000000005,1.0162,109.7345,0.14659,0.11527,7.9820000000000002E-2,4.2,80.400000000000006,7082,365,12.22]
["USA","Maine","Presque Isle","Presque Isle, Maine",310,2828,752.39880000000005,0.59530000000000005,1.0162,109.7345,0.14659,0.11527,7.9820000000000002E-2,-14.3,79.099999999999994,9344,182,12.22]
["USA","Maine","Rockland / Knox","Rockland / Knox, Maine",353,2923,752.39880000000005,0.59530000000000005,1.0162,109.7345,0.14659,0.11527,7.9820000000000002E-2,2.6,75,7601,147,12.22]
["USA","Maine","Sanford","Sanford, Maine",474,2776,752.39880000000005,0.59530000000000005,1.0162,109.7345,0.14659,0.11527,7.9820000000000002E-2,-0.2,81.900000000000006,7541,334,12.22]
["USA","Maine","Waterville","Waterville, Maine",466,2804,752.39880000000005,0.59530000000000005,1.0162,109.7345,0.14659,0.11527,7.9820000000000002E-2,-0.9,80.3,7700,297,12.22]
["USA","Maine","Wiscasset","Wiscasset, Maine",450,2790,752.39880000000005,0.59530000000000005,1.0162,109.7345,0.14659,0.11527,7.9820000000000002E-2,1.1000000000000001,79.400000000000006,7428,270,12.22]
["USA","Maryland","Andrews AFB","Andrews AFB, Maryland",1273,2267,1984.6863000000001,1.6176999999999999,15.8726,43.536200000000001,0.12837000000000001,0.10434,8.0909999999999996E-2,18.2,88.4,4421,1241,10]
["USA","Maryland","Baltimore - Washngtn Int'l Airport","Baltimore - Washngtn Int'l Airport, Maryland",1254,2298,1984.6863000000001,1.6176999999999999,15.8726,43.536200000000001,0.12837000000000001,0.10434,8.0909999999999996E-2,17.3,88.5,4567,1228,10]
["USA","Maryland","Patuxent River NAS","Patuxent River NAS, Maryland",1463,2205,1984.6863000000001,1.6176999999999999,15.8726,43.536200000000001,0.12837000000000001,0.10434,8.0909999999999996E-2,20.8,87.6,4061,1378,10]
["USA","Maryland","Salisbury","Salisbury, Maryland",1235,2215,1984.6863000000001,1.6176999999999999,15.8726,43.536200000000001,0.12837000000000001,0.10434,8.0909999999999996E-2,18.2,87.9,4320,1178,10]
["USA","Maryland","Thomas Point","Thomas Point, Maryland",1621,2298,1984.6863000000001,1.6176999999999999,15.8726,43.536200000000001,0.12837000000000001,0.10434,8.0909999999999996E-2,21.1,83,4203,1216,10]
["USA","Massachusetts","Barnstable","Barnstable, Massachusetts",823,2790,1246.6523999999999,0.68700000000000006,2.2452000000000001,43.162199999999999,0.14913000000000001,0.13841999999999999,0.12567,14,79.2,5928,487,10.68]
["USA","Massachusetts","Boston","Boston, Massachusetts",928,2565,1246.6523999999999,0.68700000000000006,2.2452000000000001,43.162199999999999,0.14913000000000001,0.13841999999999999,0.12567,12.4,84.4,5621,750,10.68]
["USA","Massachusetts","Buzzards Bay","Buzzards Bay, Massachusetts",876,2766,1246.6523999999999,0.68700000000000006,2.2452000000000001,43.162199999999999,0.14913000000000001,0.13841999999999999,0.12567,16.7,72.7,5566,281,10.68]
["USA","Massachusetts","Chatham","Chatham, Massachusetts",849,2800,1246.6523999999999,0.68700000000000006,2.2452000000000001,43.162199999999999,0.14913000000000001,0.13841999999999999,0.12567,16.399999999999999,77.099999999999994,5671,428,10.68]
["USA","Massachusetts","Lawrence","Lawrence, Massachusetts",812,2625,1246.6523999999999,0.68700000000000006,2.2452000000000001,43.162199999999999,0.14913000000000001,0.13841999999999999,0.12567,9.3000000000000007,83.8,6092,636,10.68]
["USA","Massachusetts","Marthas Vineyard","Marthas Vineyard, Massachusetts",687,2709,1246.6523999999999,0.68700000000000006,2.2452000000000001,43.162199999999999,0.14913000000000001,0.13841999999999999,0.12567,12.4,78.8,5938,395,10.68]
["USA","Massachusetts","New Bedford","New Bedford, Massachusetts",804,2638,1246.6523999999999,0.68700000000000006,2.2452000000000001,43.162199999999999,0.14913000000000001,0.13841999999999999,0.12567,11.9,81.5,5837,553,10.68]
["USA","Massachusetts","Norwood","Norwood, Massachusetts",725,2657,1246.6523999999999,0.68700000000000006,2.2452000000000001,43.162199999999999,0.14913000000000001,0.13841999999999999,0.12567,8.8000000000000007,84,6222,574,10.68]
["USA","Massachusetts","Otis","Otis, Massachusetts",796,2700,1246.6523999999999,0.68700000000000006,2.2452000000000001,43.162199999999999,0.14913000000000001,0.13841999999999999,0.12567,13,79.3,5849,474,10.68]
["USA","Massachusetts","Plymouth","Plymouth, Massachusetts",739,2698,1246.6523999999999,0.68700000000000006,2.2452000000000001,43.162199999999999,0.14913000000000001,0.13841999999999999,0.12567,9.6999999999999993,81.8,6217,517,10.68]
["USA","Massachusetts","South Weymouth NAS","South Weymouth NAS, Massachusetts",787,2564,1246.6523999999999,0.68700000000000006,2.2452000000000001,43.162199999999999,0.14913000000000001,0.13841999999999999,0.12567,10.4,84.7,5832,646,10.68]
["USA","Massachusetts","Worcester","Worcester, Massachusetts",701,2738,1246.6523999999999,0.68700000000000006,2.2452000000000001,43.162199999999999,0.14913000000000001,0.13841999999999999,0.12567,6.2,80.5,6707,453,10.68]
["USA","Michigan","Alpena","Alpena, Michigan",464,2953,1855.5189,2.0800999999999998,6.6699000000000002,37.942500000000003,0.14135,0.10935,7.6240000000000002E-2,0,81.400000000000006,7998,317,8.35]
["USA","Michigan","Antrim","Antrim, Michigan",477,2861,1855.5189,2.0800999999999998,6.6699000000000002,37.942500000000003,0.14135,0.10935,7.6240000000000002E-2,0.4,81.7,7700,332,8.35]
["USA","Michigan","Benton Harbor / Ross","Benton Harbor / Ross, Michigan",778,2767,1855.5189,2.0800999999999998,6.6699000000000002,37.942500000000003,0.14135,0.10935,7.6240000000000002E-2,10.4,82.4,6296,564,8.35]
["USA","Michigan","Cadillac","Cadillac, Michigan",450,2876,1855.5189,2.0800999999999998,6.6699000000000002,37.942500000000003,0.14135,0.10935,7.6240000000000002E-2,-1.9,81.599999999999994,8018,311,8.35]
["USA","Michigan","Chippewa","Chippewa, Michigan",372,2990,1855.5189,2.0800999999999998,6.6699000000000002,37.942500000000003,0.14135,0.10935,7.6240000000000002E-2,-5.4,77.2,8770,189,8.35]
["USA","Michigan","Copper Harbor","Copper Harbor, Michigan",402,3298,1855.5189,2.0800999999999998,6.6699000000000002,37.942500000000003,0.14135,0.10935,7.6240000000000002E-2,0.8,74.2,8822,154,8.35]
["USA","Michigan","Detroit City Airport","Detroit City Airport, Michigan",1041,2560,1855.5189,2.0800999999999998,6.6699000000000002,37.942500000000003,0.14135,0.10935,7.6240000000000002E-2,8.9,85.7,5984,898,8.35]
["USA","Michigan","Detroit Metropolitan Airport","Detroit Metropolitan Airport, Michigan",944,2545,1855.5189,2.0800999999999998,6.6699000000000002,37.942500000000003,0.14135,0.10935,7.6240000000000002E-2,6.7,84.7,6183,775,8.35]
["USA","Michigan","Detroit Willow Run Airport","Detroit Willow Run Airport, Michigan",837,2605,1855.5189,2.0800999999999998,6.6699000000000002,37.942500000000003,0.14135,0.10935,7.6240000000000002E-2,6.1,84.5,6393,680,8.35]
["USA","Michigan","Flint Bishop Int'l Airport","Flint Bishop Int'l Airport, Michigan",750,2646,1855.5189,2.0800999999999998,6.6699000000000002,37.942500000000003,0.14135,0.10935,7.6240000000000002E-2,3.7,83.9,6759,591,8.35]
["USA","Michigan","Grand Rapids","Grand Rapids, Michigan",803,2725,1855.5189,2.0800999999999998,6.6699000000000002,37.942500000000003,0.14135,0.10935,7.6240000000000002E-2,6.1,83.7,6687,626,8.35]
["USA","Michigan","Grosse Isle","Grosse Isle, Michigan",1117,2542,1855.5189,2.0800999999999998,6.6699000000000002,37.942500000000003,0.14135,0.10935,7.6240000000000002E-2,10.4,83.5,5784,861,8.35]
["USA","Michigan","Hancock","Hancock, Michigan",433,3261,1855.5189,2.0800999999999998,6.6699000000000002,37.942500000000003,0.14135,0.10935,7.6240000000000002E-2,-0.7,78.2,8928,238,8.35]
["USA","Michigan","Harbor Beach","Harbor Beach, Michigan",829,2798,1855.5189,2.0800999999999998,6.6699000000000002,37.942500000000003,0.14135,0.10935,7.6240000000000002E-2,9.6,82,6459,587,8.35]
["USA","Michigan","Holland / Tulip City",{"$f":"C386&\", \"&B386","v":"Holland / Tulip City, Michigan"},812,2758,1855.5189,2.0800999999999998,6.6699000000000002,37.942500000000003,0.14135,0.10935,7.6240000000000002E-2,10.199999999999999,82.2,6298,582,8.35]
["USA","Michigan","Houghton Lake","Houghton Lake, Michigan",502,2882,1855.5189,2.0800999999999998,6.6699000000000002,37.942500000000003,0.14135,0.10935,7.6240000000000002E-2,-0.8,81.3,7902,341,8.35]
["USA","Michigan","Howell","Howell, Michigan",836,2598,1855.5189,2.0800999999999998,6.6699000000000002,37.942500000000003,0.14135,0.10935,7.6240000000000002E-2,6.6,84.2,6322,669,8.35]
["USA","Michigan","Iron Mountain","Iron Mountain, Michigan",438,2877,1855.5189,2.0800999999999998,6.6699000000000002,37.942500000000003,0.14135,0.10935,7.6240000000000002E-2,-6.2,81.599999999999994,8535,303,8.35]
["USA","Michigan","Ironwood","Ironwood, Michigan",411,2930,1855.5189,2.0800999999999998,6.6699000000000002,37.942500000000003,0.14135,0.10935,7.6240000000000002E-2,-8.4,80.599999999999994,8962,267,8.35]
["USA","Michigan","Jackson Reynolds Field","Jackson Reynolds Field, Michigan",755,2646,1855.5189,2.0800999999999998,6.6699000000000002,37.942500000000003,0.14135,0.10935,7.6240000000000002E-2,4.5,83.3,6670,576,8.35]
["USA","Michigan","Kalamazoo / Battle Creek","Kalamazoo / Battle Creek, Michigan",898,2656,1855.5189,2.0800999999999998,6.6699000000000002,37.942500000000003,0.14135,0.10935,7.6240000000000002E-2,9,83.9,6198,707,8.35]
["USA","Michigan","Lansing / Capital City","Lansing / Capital City, Michigan",732,2671,1855.5189,2.0800999999999998,6.6699000000000002,37.942500000000003,0.14135,0.10935,7.6240000000000002E-2,3.1,83.7,6889,570,8.35]
["USA","Michigan","Mackinack Island","Mackinack Island, Michigan",425,2991,1855.5189,2.0800999999999998,6.6699000000000002,37.942500000000003,0.14135,0.10935,7.6240000000000002E-2,-5.0999999999999996,78.2,8735,234,8.35]
["USA","Michigan","Manistee","Manistee, Michigan",498,3077,1855.5189,2.0800999999999998,6.6699000000000002,37.942500000000003,0.14135,0.10935,7.6240000000000002E-2,7,79.5,7436,301,8.35]
["USA","Michigan","Manistique","Manistique, Michigan",413,3165,1855.5189,2.0800999999999998,6.6699000000000002,37.942500000000003,0.14135,0.10935,7.6240000000000002E-2,2.7,72.900000000000006,8216,136,8.35]
["USA","Michigan","Marquette","Marquette, Michigan",340,3123,1855.5189,2.0800999999999998,6.6699000000000002,37.942500000000003,0.14135,0.10935,7.6240000000000002E-2,-8.6999999999999993,78.400000000000006,9589,190,8.35]
["USA","Michigan","Menominee","Menominee, Michigan",526,2852,1855.5189,2.0800999999999998,6.6699000000000002,37.942500000000003,0.14135,0.10935,7.6240000000000002E-2,-2.1,80.7,7974,344,8.35]
["USA","Michigan","Muskegon","Muskegon, Michigan",747,2848,1855.5189,2.0800999999999998,6.6699000000000002,37.942500000000003,0.14135,0.10935,7.6240000000000002E-2,8.5,81.599999999999994,6704,517,8.35]
["USA","Michigan","Newberry","Newberry, Michigan",414,3085,1855.5189,2.0800999999999998,6.6699000000000002,37.942500000000003,0.14135,0.10935,7.6240000000000002E-2,0.7,78.900000000000006,8266,240,8.35]
["USA","Michigan","Oakland","Oakland, Michigan",813,2676,1855.5189,2.0800999999999998,6.6699000000000002,37.942500000000003,0.14135,0.10935,7.6240000000000002E-2,5.5,83.5,6634,627,8.35]
["USA","Michigan","Oscoda Wurtsmith AFB","Oscoda Wurtsmith AFB, Michigan",591,2884,1855.5189,2.0800999999999998,6.6699000000000002,37.942500000000003,0.14135,0.10935,7.6240000000000002E-2,2.6,82.7,7498,436,8.35]
["USA","Michigan","Passage Island","Passage Island, Michigan",0,3462,1855.5189,2.0800999999999998,6.6699000000000002,37.942500000000003,0.14135,0.10935,7.6240000000000002E-2,-3.7,64.7,9911,12,8.35]
["USA","Michigan","Pellston","Pellston, Michigan",448,2852,1855.5189,2.0800999999999998,6.6699000000000002,37.942500000000003,0.14135,0.10935,7.6240000000000002E-2,-3.7,81.3,8163,304,8.35]
["USA","Michigan","Rock Of Ages","Rock Of Ages, Michigan",409,3283,1855.5189,2.0800999999999998,6.6699000000000002,37.942500000000003,0.14135,0.10935,7.6240000000000002E-2,-4.3,66.7,9479,29,8.35]
["USA","Michigan","Saginaw / Tri-City Int'l Airport","Saginaw / Tri-City Int'l Airport, Michigan",725,2724,1855.5189,2.0800999999999998,6.6699000000000002,37.942500000000003,0.14135,0.10935,7.6240000000000002E-2,3.6,83.7,6968,565,8.35]
["USA","Michigan","Selfridge Air National Guard","Selfridge Air National Guard, Michigan",840,2662,1855.5189,2.0800999999999998,6.6699000000000002,37.942500000000003,0.14135,0.10935,7.6240000000000002E-2,7,84.2,6433,672,8.35]
["USA","Michigan","St. Clair","St. Clair, Michigan",639,2673,1855.5189,2.0800999999999998,6.6699000000000002,37.942500000000003,0.14135,0.10935,7.6240000000000002E-2,5.4,83.7,6638,498,8.35]
["USA","Michigan","Traverse City","Traverse City, Michigan",636,2914,1855.5189,2.0800999999999998,6.6699000000000002,37.942500000000003,0.14135,0.10935,7.6240000000000002E-2,4.5,82.5,7346,464,8.35]
["USA","Minnesota","Alexandria","Alexandria, Minnesota",702,2615,1905.7128,3.1198999999999999,3.12,111.0021,0.11353000000000001,8.8400000000000006E-2,6.5369999999999998E-2,-14.2,82.5,8631,512,6.38]
["USA","Minnesota","Austin","Austin, Minnesota",800,2528,1905.7128,3.1198999999999999,3.12,111.0021,0.11353000000000001,8.8400000000000006E-2,6.5369999999999998E-2,-7.4,82.4,7625,580,6.38]
["USA","Minnesota","Baudette","Baudette, Minnesota",400,2801,1905.7128,3.1198999999999999,3.12,111.0021,0.11353000000000001,8.8400000000000006E-2,6.5369999999999998E-2,-19.100000000000001,80.599999999999994,9814,260,6.38]
["USA","Minnesota","Bemidji","Bemidji, Minnesota",468,2770,1905.7128,3.1198999999999999,3.12,111.0021,0.11353000000000001,8.8400000000000006E-2,6.5369999999999998E-2,-16.8,81.099999999999994,9441,314,6.38]
["USA","Minnesota","Benson","Benson, Minnesota",767,2548,1905.7128,3.1198999999999999,3.12,111.0021,0.11353000000000001,8.8400000000000006E-2,6.5369999999999998E-2,-10.5,84.3,8016,617,6.38]
["USA","Minnesota","Blaine","Blaine, Minnesota",803,2592,1905.7128,3.1198999999999999,3.12,111.0021,0.11353000000000001,8.8400000000000006E-2,6.5369999999999998E-2,-4.0999999999999996,83.9,7464,632,6.38]
["USA","Minnesota","Brainerd","Brainerd, Minnesota",567,2699,1905.7128,3.1198999999999999,3.12,111.0021,0.11353000000000001,8.8400000000000006E-2,6.5369999999999998E-2,-11.8,81.8,8638,397,6.38]
["USA","Minnesota","Cambridge","Cambridge, Minnesota",662,2628,1905.7128,3.1198999999999999,3.12,111.0021,0.11353000000000001,8.8400000000000006E-2,6.5369999999999998E-2,-11.2,83.5,8344,510,6.38]
["USA","Minnesota","Crystal","Crystal, Minnesota",861,2596,1905.7128,3.1198999999999999,3.12,111.0021,0.11353000000000001,8.8400000000000006E-2,6.5369999999999998E-2,-3.7,84.2,7430,689,6.38]
["USA","Minnesota","Duluth","Duluth, Minnesota",377,2874,1905.7128,3.1198999999999999,3.12,111.0021,0.11353000000000001,8.8400000000000006E-2,6.5369999999999998E-2,-13.7,78.3,9425,209,6.38]
["USA","Minnesota","Ely","Ely, Minnesota",342,2800,1905.7128,3.1198999999999999,3.12,111.0021,0.11353000000000001,8.8400000000000006E-2,6.5369999999999998E-2,-19.600000000000001,79.3,9871,204,6.38]
["USA","Minnesota","Eveleth","Eveleth, Minnesota",335,2793,1905.7128,3.1198999999999999,3.12,111.0021,0.11353000000000001,8.8400000000000006E-2,6.5369999999999998E-2,-17.2,80.599999999999994,9567,218,6.38]
["USA","Minnesota","Fairmont","Fairmont, Minnesota",784,2543,1905.7128,3.1198999999999999,3.12,111.0021,0.11353000000000001,8.8400000000000006E-2,6.5369999999999998E-2,-6.3,83.3,7555,598,6.38]
["USA","Minnesota","Faribault","Faribault, Minnesota",739,2533,1905.7128,3.1198999999999999,3.12,111.0021,0.11353000000000001,8.8400000000000006E-2,6.5369999999999998E-2,-8.5,83.7,7758,576,6.38]
["USA","Minnesota","Fergus Falls","Fergus Falls, Minnesota",820,2531,1905.7128,3.1198999999999999,3.12,111.0021,0.11353000000000001,8.8400000000000006E-2,6.5369999999999998E-2,-13.2,82.8,8246,608,6.38]
["USA","Minnesota","Flying Cloud","Flying Cloud, Minnesota",982,2507,1905.7128,3.1198999999999999,3.12,111.0021,0.11353000000000001,8.8400000000000006E-2,6.5369999999999998E-2,-4,84.4,7207,794,6.38]
["USA","Minnesota","Fosston","Fosston, Minnesota",496,2765,1905.7128,3.1198999999999999,3.12,111.0021,0.11353000000000001,8.8400000000000006E-2,6.5369999999999998E-2,-17.600000000000001,81.099999999999994,9516,333,6.38]
["USA","Minnesota","Glenwood","Glenwood, Minnesota",741,2608,1905.7128,3.1198999999999999,3.12,111.0021,0.11353000000000001,8.8400000000000006E-2,6.5369999999999998E-2,-10.8,83.6,8236,574,6.38]
["USA","Minnesota","Grand Marais","Grand Marais, Minnesota",274,3161,1905.7128,3.1198999999999999,3.12,111.0021,0.11353000000000001,8.8400000000000006E-2,6.5369999999999998E-2,-10.7,74.900000000000006,9970,113,6.38]
["USA","Minnesota","Grand Rapids","Grand Rapids, Minnesota",380,2808,1905.7128,3.1198999999999999,3.12,111.0021,0.11353000000000001,8.8400000000000006E-2,6.5369999999999998E-2,-14.8,79.2,9338,225,6.38]
["USA","Minnesota","Hallock","Hallock, Minnesota",458,2756,1905.7128,3.1198999999999999,3.12,111.0021,0.11353000000000001,8.8400000000000006E-2,6.5369999999999998E-2,-19.8,82.1,9739,326,6.38]
["USA","Minnesota","Hibbing - Chisholm Airport","Hibbing - Chisholm Airport, Minnesota",310,2848,1905.7128,3.1198999999999999,3.12,111.0021,0.11353000000000001,8.8400000000000006E-2,6.5369999999999998E-2,-18,79.400000000000006,9848,186,6.38]
["USA","Minnesota","Hutchinson","Hutchinson, Minnesota",747,2561,1905.7128,3.1198999999999999,3.12,111.0021,0.11353000000000001,8.8400000000000006E-2,6.5369999999999998E-2,-9.6999999999999993,83.6,7970,579,6.38]
["USA","Minnesota","International Falls","International Falls, Minnesota",362,2792,1905.7128,3.1198999999999999,3.12,111.0021,0.11353000000000001,8.8400000000000006E-2,6.5369999999999998E-2,-20.9,80,9992,226,6.38]
["USA","Minnesota","Litchfield","Litchfield, Minnesota",760,2604,1905.7128,3.1198999999999999,3.12,111.0021,0.11353000000000001,8.8400000000000006E-2,6.5369999999999998E-2,-9,82.2,8030,545,6.38]
["USA","Minnesota","Little Falls","Little Falls, Minnesota",629,2651,1905.7128,3.1198999999999999,3.12,111.0021,0.11353000000000001,8.8400000000000006E-2,6.5369999999999998E-2,-11.6,82.4,8462,456,6.38]
["USA","Minnesota","Mankato","Mankato, Minnesota",825,2524,1905.7128,3.1198999999999999,3.12,111.0021,0.11353000000000001,8.8400000000000006E-2,6.5369999999999998E-2,-8.1,82.4,7689,598,6.38]
["USA","Minnesota","Minneapolis-St. Paul Int'l Airport","Minneapolis-St. Paul Int'l Airport, Minnesota",901,2501,1905.7128,3.1198999999999999,3.12,111.0021,0.11353000000000001,8.8400000000000006E-2,6.5369999999999998E-2,-7.6,85,7565,751,6.38]
["USA","Minnesota","Princeton","Princeton, Minnesota",665,2620,1905.7128,3.1198999999999999,3.12,111.0021,0.11353000000000001,8.8400000000000006E-2,6.5369999999999998E-2,-7.9,83.7,7957,518,6.38]
["USA","Minnesota","Red Wing","Red Wing, Minnesota",798,2504,1905.7128,3.1198999999999999,3.12,111.0021,0.11353000000000001,8.8400000000000006E-2,6.5369999999999998E-2,-8,84.1,7617,635,6.38]
["USA","Minnesota","Redwood Falls","Redwood Falls, Minnesota",812,2467,1905.7128,3.1198999999999999,3.12,111.0021,0.11353000000000001,8.8400000000000006E-2,6.5369999999999998E-2,-10.5,85.8,7760,704,6.38]
["USA","Minnesota","Rochester","Rochester, Minnesota",710,2580,1905.7128,3.1198999999999999,3.12,111.0021,0.11353000000000001,8.8400000000000006E-2,6.5369999999999998E-2,-9.1999999999999993,82.3,7975,512,6.38]
["USA","Minnesota","St. Cloud","St. Cloud, Minnesota",614,2625,1905.7128,3.1198999999999999,3.12,111.0021,0.11353000000000001,8.8400000000000006E-2,6.5369999999999998E-2,-12.9,83.5,8520,473,6.38]
["USA","Minnesota","St. James","St. James, Minnesota",878,2513,1905.7128,3.1198999999999999,3.12,111.0021,0.11353000000000001,8.8400000000000006E-2,6.5369999999999998E-2,-3.6,84.3,7182,706,6.38]
["USA","Minnesota","St. Paul","St. Paul, Minnesota",859,2489,1905.7128,3.1198999999999999,3.12,111.0021,0.11353000000000001,8.8400000000000006E-2,6.5369999999999998E-2,-7.6,83.7,7529,669,6.38]
["USA","Minnesota","Two Harbors","Two Harbors, Minnesota",300,2991,1905.7128,3.1198999999999999,3.12,111.0021,0.11353000000000001,8.8400000000000006E-2,6.5369999999999998E-2,-10.7,77.400000000000006,9435,155,6.38]
["USA","Minnesota","Willmar","Willmar, Minnesota",717,2551,1905.7128,3.1198999999999999,3.12,111.0021,0.11353000000000001,8.8400000000000006E-2,6.5369999999999998E-2,-13.3,82.2,8324,514,6.38]
["USA","Minnesota","Winona","Winona, Minnesota",906,2429,1905.7128,3.1198999999999999,3.12,111.0021,0.11353000000000001,8.8400000000000006E-2,6.5369999999999998E-2,-4.3,84.4,7014,732,6.38]
["USA","Minnesota","Worthington","Worthington, Minnesota",727,2615,1905.7128,3.1198999999999999,3.12,111.0021,0.11353000000000001,8.8400000000000006E-2,6.5369999999999998E-2,-6.5,82.2,7792,521,6.38]
["USA","Mississippi","Columbus AFB","Columbus AFB, Mississippi",1849,1556,1348.692,1.5526,2.1842000000000001,23.697199999999999,0.10264,9.3270000000000006E-2,6.2390000000000001E-2,25,92.4,2594,2111,7.38]
["USA","Mississippi","Golden Triangle Regional Airport",{"$f":"C450&\", \"&B450","v":"Golden Triangle Regional Airport, Mississippi"},1854,1607,1348.692,1.5526,2.1842000000000001,23.697199999999999,0.10264,9.3270000000000006E-2,6.2390000000000001E-2,24.8,91.4,2692,2039,7.38]
["USA","Mississippi","Greenwood","Greenwood, Mississippi",1983,1525,1348.692,1.5526,2.1842000000000001,23.697199999999999,0.10264,9.3270000000000006E-2,6.2390000000000001E-2,24.7,92.2,2560,2247,7.38]
["USA","Mississippi","Hattiesburg","Hattiesburg, Mississippi",2100,1325,1348.692,1.5526,2.1842000000000001,23.697199999999999,0.10264,9.3270000000000006E-2,6.2390000000000001E-2,28,91.2,2043,2292,7.38]
["USA","Mississippi","Jackson","Jackson, Mississippi",2021,1415,1348.692,1.5526,2.1842000000000001,23.697199999999999,0.10264,9.3270000000000006E-2,6.2390000000000001E-2,25.8,91.9,2311,2265,7.38]
["USA","Mississippi","Keesler AFB / Biloxi","Keesler AFB / Biloxi, Mississippi",2615,1136,1348.692,1.5526,2.1842000000000001,23.697199999999999,0.10264,9.3270000000000006E-2,6.2390000000000001E-2,34.9,90.3,1425,2757,7.38]
["USA","Mississippi","McComb","McComb, Mississippi",2146,1264,1348.692,1.5526,2.1842000000000001,23.697199999999999,0.10264,9.3270000000000006E-2,6.2390000000000001E-2,28.4,90.9,1927,2316,7.38]
["USA","Mississippi","Meridian","Meridian, Mississippi",1924,1420,1348.692,1.5526,2.1842000000000001,23.697199999999999,0.10264,9.3270000000000006E-2,6.2390000000000001E-2,25.8,91.8,2320,2149,7.38]
["USA","Mississippi","Meridian Naas","Meridian Naas, Mississippi",1917,1432,1348.692,1.5526,2.1842000000000001,23.697199999999999,0.10264,9.3270000000000006E-2,6.2390000000000001E-2,25.5,92.9,2357,2229,7.38]
["USA","Mississippi","Natchez","Natchez, Mississippi",2097,1388,1348.692,1.5526,2.1842000000000001,23.697199999999999,0.10264,9.3270000000000006E-2,6.2390000000000001E-2,27.8,90.4,2152,2219,7.38]
["USA","Mississippi","Tupelo","Tupelo, Mississippi",1783,1662,1348.692,1.5526,2.1842000000000001,23.697199999999999,0.10264,9.3270000000000006E-2,6.2390000000000001E-2,22.7,91.5,2929,1969,7.38]
["USA","Missouri","Cape Girardeau","Cape Girardeau, Missouri",1456,1974,2106.8341,1.7038,5.8242000000000003,24.920999999999999,0.10169,8.1989999999999993E-2,5.8930000000000003E-2,13.8,90.4,4211,1541,9.5399999999999991]
["USA","Missouri","Columbia","Columbia, Missouri",1234,2068,2106.8341,1.7038,5.8242000000000003,24.920999999999999,0.10169,8.1989999999999993E-2,5.8930000000000003E-2,7.1,89,4990,1234,9.5399999999999991]
["USA","Missouri","Jefferson City","Jefferson City, Missouri",1314,2052,2106.8341,1.7038,5.8242000000000003,24.920999999999999,0.10169,8.1989999999999993E-2,5.8930000000000003E-2,12.2,90.2,4514,1380,9.5399999999999991]
["USA","Missouri","Joplin","Joplin, Missouri",1504,1858,2106.8341,1.7038,5.8242000000000003,24.920999999999999,0.10169,8.1989999999999993E-2,5.8930000000000003E-2,12.3,91.3,4080,1648,9.5399999999999991]
["USA","Missouri","Kaiser","Kaiser, Missouri",1256,2072,2106.8341,1.7038,5.8242000000000003,24.920999999999999,0.10169,8.1989999999999993E-2,5.8930000000000003E-2,11.8,90.5,4593,1334,9.5399999999999991]
["USA","Missouri","Kansas City","Kansas City, Missouri",1512,1954,2106.8341,1.7038,5.8242000000000003,24.920999999999999,0.10169,8.1989999999999993E-2,5.8930000000000003E-2,8.6,91.3,4593,1657,9.5399999999999991]
["USA","Missouri","Kansas City Int'l Airport","Kansas City Int'l Airport, Missouri",1307,2055,2106.8341,1.7038,5.8242000000000003,24.920999999999999,0.10169,8.1989999999999993E-2,5.8930000000000003E-2,5.4,89.9,5104,1356,9.5399999999999991]
["USA","Missouri","Kirksville","Kirksville, Missouri",1134,2115,2106.8341,1.7038,5.8242000000000003,24.920999999999999,0.10169,8.1989999999999993E-2,5.8930000000000003E-2,1.3,88.3,5613,1101,9.5399999999999991]
["USA","Missouri","Poplar Bluff","Poplar Bluff, Missouri",1440,1970,2106.8341,1.7038,5.8242000000000003,24.920999999999999,0.10169,8.1989999999999993E-2,5.8930000000000003E-2,15.5,90.1,4063,1506,9.5399999999999991]
["USA","Missouri","Sedalia","Sedalia, Missouri",1327,2052,2106.8341,1.7038,5.8242000000000003,24.920999999999999,0.10169,8.1989999999999993E-2,5.8930000000000003E-2,11.7,90.3,4557,1399,9.5399999999999991]
["USA","Missouri","Spickard","Spickard, Missouri",1130,2206,2106.8341,1.7038,5.8242000000000003,24.920999999999999,0.10169,8.1989999999999993E-2,5.8930000000000003E-2,4.8,89.1,5534,1135,9.5399999999999991]
["USA","Missouri","Springfield","Springfield, Missouri",1338,1978,2106.8341,1.7038,5.8242000000000003,24.920999999999999,0.10169,8.1989999999999993E-2,5.8930000000000003E-2,10.9,89.5,4459,1366,9.5399999999999991]
["USA","Missouri","St. Louis","St. Louis, Missouri",1523,1973,2106.8341,1.7038,5.8242000000000003,24.920999999999999,0.10169,8.1989999999999993E-2,5.8930000000000003E-2,10.199999999999999,90.7,4504,1631,9.5399999999999991]
["USA","Missouri","Vichy Rolla National Airport","Vichy Rolla National Airport, Missouri",1269,2055,2106.8341,1.7038,5.8242000000000003,24.920999999999999,0.10169,8.1989999999999993E-2,5.8930000000000003E-2,10.3,89.6,4684,1301,9.5399999999999991]
["USA","Missouri","Whiteman AFB","Whiteman AFB, Missouri",1348,2016,2106.8341,1.7038,5.8242000000000003,24.920999999999999,0.10169,8.1989999999999993E-2,5.8930000000000003E-2,8,90.7,4789,1443,9.5399999999999991]
["USA","Montana","Billings","Billings, Montana",664,2308,2259.2727,2.8060999999999998,2.4922,27.297799999999999,0.10083,9.128E-2,5.1040000000000002E-2,-5.5,88,6779,636,7.98]
["USA","Montana","Bozeman","Bozeman, Montana",262,2690,2259.2727,2.8060999999999998,2.4922,27.297799999999999,0.10083,9.128E-2,5.1040000000000002E-2,-9.6999999999999993,84.4,8372,212,7.98]
["USA","Montana","Butte","Butte, Montana",111,2885,2259.2727,2.8060999999999998,2.4922,27.297799999999999,0.10083,9.128E-2,5.1040000000000002E-2,-11.6,81.5,9209,76,7.98]
["USA","Montana","Cut Bank","Cut Bank, Montana",225,2639,2259.2727,2.8060999999999998,2.4922,27.297799999999999,0.10083,9.128E-2,5.1040000000000002E-2,-13,81.5,8576,155,7.98]
["USA","Montana","Dillon","Dillon, Montana",274,3006,2259.2727,2.8060999999999998,2.4922,27.297799999999999,0.10083,9.128E-2,5.1040000000000002E-2,1.4,82.1,7967,195,7.98]
["USA","Montana","Glasgow","Glasgow, Montana",562,2467,2259.2727,2.8060999999999998,2.4922,27.297799999999999,0.10083,9.128E-2,5.1040000000000002E-2,-16.7,87.7,8397,532,7.98]
["USA","Montana","Glendive","Glendive, Montana",520,2548,2259.2727,2.8060999999999998,2.4922,27.297799999999999,0.10083,9.128E-2,5.1040000000000002E-2,-11.9,87.9,8165,496,7.98]
["USA","Montana","Great Falls","Great Falls, Montana",401,2588,2259.2727,2.8060999999999998,2.4922,27.297799999999999,0.10083,9.128E-2,5.1040000000000002E-2,-6.4,83.6,7699,311,7.98]
["USA","Montana","Great Falls Int'l Airport","Great Falls Int'l Airport, Montana",392,2381,2259.2727,2.8060999999999998,2.4922,27.297799999999999,0.10083,9.128E-2,5.1040000000000002E-2,-11.2,85.1,7560,328,7.98]
["USA","Montana","Havre City","Havre City, Montana",419,2365,2259.2727,2.8060999999999998,2.4922,27.297799999999999,0.10083,9.128E-2,5.1040000000000002E-2,-17.7,87.3,8149,389,7.98]
["USA","Montana","Helena","Helena, Montana",432,2518,2259.2727,2.8060999999999998,2.4922,27.297799999999999,0.10083,9.128E-2,5.1040000000000002E-2,-8.1999999999999993,85.8,7679,374,7.98]
["USA","Montana","Jordan","Jordan, Montana",469,2341,2259.2727,2.8060999999999998,2.4922,27.297799999999999,0.10083,9.128E-2,5.1040000000000002E-2,-17.7,89.4,8068,477,7.98]
["USA","Montana","Kalispell Glacier Park","Kalispell Glacier Park, Montana",206,2942,2259.2727,2.8060999999999998,2.4922,27.297799999999999,0.10083,9.128E-2,5.1040000000000002E-2,-0.7,82.9,8053,154,7.98]
["USA","Montana","Lewistown","Lewistown, Montana",277,2643,2259.2727,2.8060999999999998,2.4922,27.297799999999999,0.10083,9.128E-2,5.1040000000000002E-2,-10,83.3,8259,211,7.98]
["USA","Montana","Malmstrom AFB","Malmstrom AFB, Montana",483,2235,2259.2727,2.8060999999999998,2.4922,27.297799999999999,0.10083,9.128E-2,5.1040000000000002E-2,-10.3,86,7013,423,7.98]
["USA","Montana","Miles","Miles, Montana",743,2317,2259.2727,2.8060999999999998,2.4922,27.297799999999999,0.10083,9.128E-2,5.1040000000000002E-2,-11.5,91,7386,805,7.98]
["USA","Montana","Missoula","Missoula, Montana",341,2842,2259.2727,2.8060999999999998,2.4922,27.297799999999999,0.10083,9.128E-2,5.1040000000000002E-2,1.8,85.7,7484,294,7.98]
["USA","Montana","Sidney","Sidney, Montana",513,2549,2259.2727,2.8060999999999998,2.4922,27.297799999999999,0.10083,9.128E-2,5.1040000000000002E-2,-13.3,86.3,8317,455,7.98]
["USA","Nebraska","Ainsworth","Ainsworth, Nebraska",815,2428,2380.8357999999998,4.0068999999999999,6.4137000000000004,27.1374,0.10044,8.3820000000000006E-2,7.0069999999999993E-2,-0.4,88.5,6616,798,6.19]
["USA","Nebraska","Alliance","Alliance, Nebraska",628,2584,2380.8357999999998,4.0068999999999999,6.4137000000000004,27.1374,0.10044,8.3820000000000006E-2,7.0069999999999993E-2,-0.1,90.7,7008,672,6.19]
["USA","Nebraska","Beatrice","Beatrice, Nebraska",1166,2190,2380.8357999999998,4.0068999999999999,6.4137000000000004,27.1374,0.10044,8.3820000000000006E-2,7.0069999999999993E-2,2.8,90.7,5677,1249,6.19]
["USA","Nebraska","Brewster Field","Brewster Field, Nebraska",970,2304,2380.8357999999998,4.0068999999999999,6.4137000000000004,27.1374,0.10044,8.3820000000000006E-2,7.0069999999999993E-2,4.5999999999999996,90.1,5799,1014,6.19]
["USA","Nebraska","Columbus","Columbus, Nebraska",930,2411,2380.8357999999998,4.0068999999999999,6.4137000000000004,27.1374,0.10044,8.3820000000000006E-2,7.0069999999999993E-2,-0.3,88.2,6559,899,6.19]
["USA","Nebraska","Fremont","Fremont, Nebraska",1092,2289,2380.8357999999998,4.0068999999999999,6.4137000000000004,27.1374,0.10044,8.3820000000000006E-2,7.0069999999999993E-2,1.2,88.3,6084,1060,6.19]
["USA","Nebraska","Grand Island","Grand Island, Nebraska",1012,2272,2380.8357999999998,4.0068999999999999,6.4137000000000004,27.1374,0.10044,8.3820000000000006E-2,7.0069999999999993E-2,-0.1,89.8,6164,1046,6.19]
["USA","Nebraska","Hastings","Hastings, Nebraska",1065,2227,2380.8357999999998,4.0068999999999999,6.4137000000000004,27.1374,0.10044,8.3820000000000006E-2,7.0069999999999993E-2,1.8,90.4,5864,1127,6.19]
["USA","Nebraska","Kearney","Kearney, Nebraska",950,2372,2380.8357999999998,4.0068999999999999,6.4137000000000004,27.1374,0.10044,8.3820000000000006E-2,7.0069999999999993E-2,2.6,88.4,6166,926,6.19]
["USA","Nebraska","Lincoln","Lincoln, Nebraska",1106,2223,2380.8357999999998,4.0068999999999999,6.4137000000000004,27.1374,0.10044,8.3820000000000006E-2,7.0069999999999993E-2,0.3,90.7,5993,1184,6.19]
["USA","Nebraska","McCook","McCook, Nebraska",1082,2276,2380.8357999999998,4.0068999999999999,6.4137000000000004,27.1374,0.10044,8.3820000000000006E-2,7.0069999999999993E-2,7.1,93.4,5492,1280,6.19]
["USA","Nebraska","Norfolk","Norfolk, Nebraska",982,2319,2380.8357999999998,4.0068999999999999,6.4137000000000004,27.1374,0.10044,8.3820000000000006E-2,7.0069999999999993E-2,-2.4,88.6,6512,966,6.19]
["USA","Nebraska","North Platte","North Platte, Nebraska",804,2387,2380.8357999999998,4.0068999999999999,6.4137000000000004,27.1374,0.10044,8.3820000000000006E-2,7.0069999999999993E-2,-0.7,89.7,6534,827,6.19]
["USA","Nebraska","O`Neill","O`Neill, Nebraska",870,2402,2380.8357999999998,4.0068999999999999,6.4137000000000004,27.1374,0.10044,8.3820000000000006E-2,7.0069999999999993E-2,-1.7,88.4,6675,848,6.19]
["USA","Nebraska","Offutt AFB / Bellevue","Offutt AFB / Bellevue, Nebraska",1188,2204,2380.8357999999998,4.0068999999999999,6.4137000000000004,27.1374,0.10044,8.3820000000000006E-2,7.0069999999999993E-2,1.5,88.8,5832,1178,6.19]
["USA","Nebraska","Omaha Eppley Airfield","Omaha Eppley Airfield, Nebraska",1114,2238,2380.8357999999998,4.0068999999999999,6.4137000000000004,27.1374,0.10044,8.3820000000000006E-2,7.0069999999999993E-2,-0.7,88.9,6127,1109,6.19]
["USA","Nebraska","Scottsbluff","Scottsbluff, Nebraska",694,2392,2380.8357999999998,4.0068999999999999,6.4137000000000004,27.1374,0.10044,8.3820000000000006E-2,7.0069999999999993E-2,-1.1000000000000001,89.9,6587,720,6.19]
["USA","Nebraska","Sidney","Sidney, Nebraska",643,2467,2380.8357999999998,4.0068999999999999,6.4137000000000004,27.1374,0.10044,8.3820000000000006E-2,7.0069999999999993E-2,0,89.5,6682,656,6.19]
["USA","Nebraska","Tekamah","Tekamah, Nebraska",980,2315,2380.8357999999998,4.0068999999999999,6.4137000000000004,27.1374,0.10044,8.3820000000000006E-2,7.0069999999999993E-2,0,89.6,6269,1005,6.19]
["USA","Nebraska","Valentine","Valentine, Nebraska",767,2368,2380.8357999999998,4.0068999999999999,6.4137000000000004,27.1374,0.10044,8.3820000000000006E-2,7.0069999999999993E-2,-5.8,90.5,6985,815,6.19]
["USA","Nevada","Caliente","Caliente, Nevada",680,2362,1127.0987,0.83879999999999999,0.2477,19.151399999999999,0.11828,8.8300000000000003E-2,6.4839999999999995E-2,12.2,93.5,5196,807,7.43]
["USA","Nevada","Elko",{"$f":"C514&\", \"&B514","v":"Elko, Nevada"},341,2718,1127.0987,0.83879999999999999,0.2477,19.151399999999999,0.11828,8.8300000000000003E-2,6.4839999999999995E-2,1.9,89.7,7147,351,7.43]
["USA","Nevada","Ely","Ely, Nevada",248,2768,1127.0987,0.83879999999999999,0.2477,19.151399999999999,0.11828,8.8300000000000003E-2,6.4839999999999995E-2,0.9,86.1,7393,218,7.43]
["USA","Nevada","Eureka","Eureka, Nevada",422,2908,1127.0987,0.83879999999999999,0.2477,19.151399999999999,0.11828,8.8300000000000003E-2,6.4839999999999995E-2,7.4,84.9,6978,350,7.43]
["USA","Nevada","Fallon Naas","Fallon Naas, Nevada",807,2331,1127.0987,0.83879999999999999,0.2477,19.151399999999999,0.11828,8.8300000000000003E-2,6.4839999999999995E-2,15.1,94.1,4847,978,7.43]
["USA","Nevada","Las Vegas Mccarran Int'l Airport","Las Vegas Mccarran Int'l Airport, Nevada",2076,1594,1127.0987,0.83879999999999999,0.2477,19.151399999999999,0.11828,8.8300000000000003E-2,6.4839999999999995E-2,33.299999999999997,103.7,2105,3348,7.43]
["USA","Nevada","Lovelock","Lovelock, Nevada",710,2407,1127.0987,0.83879999999999999,0.2477,19.151399999999999,0.11828,8.8300000000000003E-2,6.4839999999999995E-2,10.3,94,5485,858,7.43]
["USA","Nevada","Mercury","Mercury, Nevada",1583,1914,1127.0987,0.83879999999999999,0.2477,19.151399999999999,0.11828,8.8300000000000003E-2,6.4839999999999995E-2,28.7,99.3,2895,2263,7.43]
["USA","Nevada","Nellis AFB","Nellis AFB, Nevada",2021,1525,1127.0987,0.83879999999999999,0.2477,19.151399999999999,0.11828,8.8300000000000003E-2,6.4839999999999995E-2,31.5,104.7,2128,3343,7.43]
["USA","Nevada","Reno","Reno, Nevada",652,2601,1127.0987,0.83879999999999999,0.2477,19.151399999999999,0.11828,8.8300000000000003E-2,6.4839999999999995E-2,17,90.6,5201,695,7.43]
["USA","Nevada","Tonopah","Tonopah, Nevada",727,2519,1127.0987,0.83879999999999999,0.2477,19.151399999999999,0.11828,8.8300000000000003E-2,6.4839999999999995E-2,14,90.8,5352,781,7.43]
["USA","Nevada","Winnemucca","Winnemucca, Nevada",476,2641,1127.0987,0.83879999999999999,0.2477,19.151399999999999,0.11828,8.8300000000000003E-2,6.4839999999999995E-2,8.1999999999999993,92.5,6251,545,7.43]
["USA","New Hampshire","Berlin","Berlin, New Hampshire",234,2853,1240.7663,0.77490000000000003,6.0039999999999996,68.827100000000002,0.16070000000000001,0.13361000000000001,0.11831999999999999,-10.7,80.599999999999994,8998,152,11.95]
["USA","New Hampshire","Concord","Concord, New Hampshire",582,2667,1240.7663,0.77490000000000003,6.0039999999999996,68.827100000000002,0.16070000000000001,0.13361000000000001,0.11831999999999999,0.4,84,7180,461,11.95]
["USA","New Hampshire","Keene","Keene, New Hampshire",554,2663,1240.7663,0.77490000000000003,6.0039999999999996,68.827100000000002,0.16070000000000001,0.13361000000000001,0.11831999999999999,-0.2,82.1,7235,395,11.95]
["USA","New Hampshire","Isle Of Shoals","Isle Of Shoals, New Hampshire",590,2880,1240.7663,0.77490000000000003,6.0039999999999996,68.827100000000002,0.16070000000000001,0.13361000000000001,0.11831999999999999,11.3,74.8,6444,241,11.95]
["USA","New Hampshire","Jaffrey","Jaffrey, New Hampshire",536,2744,1240.7663,0.77490000000000003,6.0039999999999996,68.827100000000002,0.16070000000000001,0.13361000000000001,0.11831999999999999,1.1000000000000001,81.2,7307,362,11.95]
["USA","New Hampshire","Laconia","Laconia, New Hampshire",605,2737,1240.7663,0.77490000000000003,6.0039999999999996,68.827100000000002,0.16070000000000001,0.13361000000000001,0.11831999999999999,0.6,81.7,7345,421,11.95]
["USA","New Hampshire","Lebanon","Lebanon, New Hampshire",538,2691,1240.7663,0.77490000000000003,6.0039999999999996,68.827100000000002,0.16070000000000001,0.13361000000000001,0.11831999999999999,-2.7,82.7,7591,397,11.95]
["USA","New Hampshire","Manchester","Manchester, New Hampshire",853,2557,1240.7663,0.77490000000000003,6.0039999999999996,68.827100000000002,0.16070000000000001,0.13361000000000001,0.11831999999999999,6.7,85.8,6212,739,11.95]
["USA","New Hampshire","Mount Washington","Mount Washington, New Hampshire",0,3944,1240.7663,0.77490000000000003,6.0039999999999996,68.827100000000002,0.16070000000000001,0.13361000000000001,0.11831999999999999,-17.7,57,13591,0,11.95]
["USA","New Hampshire","Portsmouth","Portsmouth, New Hampshire",737,2698,1240.7663,0.77490000000000003,6.0039999999999996,68.827100000000002,0.16070000000000001,0.13361000000000001,0.11831999999999999,7.7,82.4,6442,534,11.95]
["USA","New Jersey","Atlantic City","Atlantic City, New Jersey",1116,2371,1264.8905999999999,0.73360000000000003,1.3086,24.8919,0.15783,0.12776999999999999,0.10517,14.9,86.4,4950,995,8.5]
["USA","New Jersey","Belmar - Farmingdale","Belmar - Farmingdale, New Jersey",1078,2492,1264.8905999999999,0.73360000000000003,1.3086,24.8919,0.15783,0.12776999999999999,0.10517,15.7,84.3,5118,867,8.5]
["USA","New Jersey","Cape May County","Cape May County, New Jersey",1274,2407,1264.8905999999999,0.73360000000000003,1.3086,24.8919,0.15783,0.12776999999999999,0.10517,19.2,83.9,4593,1003,8.5]
["USA","New Jersey","Mcguire AFB","Mcguire AFB, New Jersey",1131,2355,1264.8905999999999,0.73360000000000003,1.3086,24.8919,0.15783,0.12776999999999999,0.10517,15.1,87.8,4897,1074,8.5]
["USA","New Jersey","Millville","Millville, New Jersey",1153,2347,1264.8905999999999,0.73360000000000003,1.3086,24.8919,0.15783,0.12776999999999999,0.10517,15.3,86.9,4860,1052,8.5]
["USA","New Jersey","Newark","Newark, New Jersey",1285,2284,1264.8905999999999,0.73360000000000003,1.3086,24.8919,0.15783,0.12776999999999999,0.10517,15.5,88.2,4710,1242,8.5]
["USA","New Jersey","Teterboro","Teterboro, New Jersey",1103,2402,1264.8905999999999,0.73360000000000003,1.3086,24.8919,0.15783,0.12776999999999999,0.10517,14.5,86.8,5055,1002,8.5]
["USA","New Jersey","Trenton","Trenton, New Jersey",1067,2425,1264.8905999999999,0.73360000000000003,1.3086,24.8919,0.15783,0.12776999999999999,0.10517,14.1,87.2,5144,987,8.5]
["USA","New Mexico","Alamogordo","Alamogordo, New Mexico",1489,1704,1368.8786,1.4114,0.26169999999999999,22.272600000000001,0.11375,9.325E-2,5.8310000000000001E-2,25.1,96.6,2833,1960,6.31]
["USA","New Mexico","Albuquerque","Albuquerque, New Mexico",1264,2230,1368.8786,1.4114,0.26169999999999999,22.272600000000001,0.11375,9.325E-2,5.8310000000000001E-2,21.2,90.6,4069,1348,6.31]
["USA","New Mexico","Cannon AFB","Cannon AFB, New Mexico",1211,1936,1368.8786,1.4114,0.26169999999999999,22.272600000000001,0.11375,9.325E-2,5.8310000000000001E-2,17.399999999999999,92.2,3839,1372,6.31]
["USA","New Mexico","Carlsbad","Carlsbad, New Mexico",1650,1552,1368.8786,1.4114,0.26169999999999999,22.272600000000001,0.11375,9.325E-2,5.8310000000000001E-2,24.2,97.3,2639,2221,6.31]
["USA","New Mexico","Clayton","Clayton, New Mexico",890,2190,1368.8786,1.4114,0.26169999999999999,22.272600000000001,0.11375,9.325E-2,5.8310000000000001E-2,11.7,89.6,4863,912,6.31]
["USA","New Mexico","Clovis","Clovis, New Mexico",1090,2089,1368.8786,1.4114,0.26169999999999999,22.272600000000001,0.11375,9.325E-2,5.8310000000000001E-2,18,91.2,4091,1190,6.31]
["USA","New Mexico","Farmington","Farmington, New Mexico",856,2445,1368.8786,1.4114,0.26169999999999999,22.272600000000001,0.11375,9.325E-2,5.8310000000000001E-2,12.3,90,5369,892,6.31]
["USA","New Mexico","Gallup","Gallup, New Mexico",438,2504,1368.8786,1.4114,0.26169999999999999,22.272600000000001,0.11375,9.325E-2,5.8310000000000001E-2,5.4,86.5,6218,392,6.31]
["USA","New Mexico","Holloman AFB","Holloman AFB, New Mexico",1396,1839,1368.8786,1.4114,0.26169999999999999,22.272600000000001,0.11375,9.325E-2,5.8310000000000001E-2,22.5,93.9,3257,1681,6.31]
["USA","New Mexico","Roswell","Roswell, New Mexico",1485,1721,1368.8786,1.4114,0.26169999999999999,22.272600000000001,0.11375,9.325E-2,5.8310000000000001E-2,20.8,95.2,3169,1869,6.31]
["USA","New Mexico","Sierra Blanca","Sierra Blanca, New Mexico",742,2261,1368.8786,1.4114,0.26169999999999999,22.272600000000001,0.11375,9.325E-2,5.8310000000000001E-2,19.2,83.5,4315,572,6.31]
["USA","New Mexico","Taos","Taos, New Mexico",229,2738,1368.8786,1.4114,0.26169999999999999,22.272600000000001,0.11375,9.325E-2,5.8310000000000001E-2,4,82.5,6958,167,6.31]
["USA","New Mexico","Truth Or Consequences","Truth Or Consequences, New Mexico",1426,1865,1368.8786,1.4114,0.26169999999999999,22.272600000000001,0.11375,9.325E-2,5.8310000000000001E-2,25.4,93,3077,1664,6.31]
["USA","New Mexico","White Sands","White Sands, New Mexico",1488,1664,1368.8786,1.4114,0.26169999999999999,22.272600000000001,0.11375,9.325E-2,5.8310000000000001E-2,22.5,94.2,2946,1811,6.31]
["USA","New York","Albany","Albany, New York",772,2554,1295.4848999999999,0.94850000000000001,1.6877,33.782699999999998,0.17616000000000001,0.15056,6.6960000000000006E-2,2.9,83.4,6608,592,7.84]
["USA","New York","Ambrose Light","Ambrose Light, New York",1232,2507,1295.4848999999999,0.94850000000000001,1.6877,33.782699999999998,0.17616000000000001,0.15056,6.6960000000000006E-2,17.7,78.400000000000006,4941,688,7.84]
["USA","New York","Binghamton","Binghamton, New York",640,2777,1295.4848999999999,0.94850000000000001,1.6877,33.782699999999998,0.17616000000000001,0.15056,6.6960000000000006E-2,3.6,80,7105,400,7.84]
["USA","New York","Buffalo","Buffalo, New York",807,2691,1295.4848999999999,0.94850000000000001,1.6877,33.782699999999998,0.17616000000000001,0.15056,6.6960000000000006E-2,6.7,81.599999999999994,6538,558,7.84]
["USA","New York","Dunkirk","Dunkirk, New York",938,2774,1295.4848999999999,0.94850000000000001,1.6877,33.782699999999998,0.17616000000000001,0.15056,6.6960000000000006E-2,11.1,77.8,6230,500,7.84]
["USA","New York","Elmira","Elmira, New York",611,2636,1295.4848999999999,0.94850000000000001,1.6877,33.782699999999998,0.17616000000000001,0.15056,6.6960000000000006E-2,3.3,83.7,6777,476,7.84]
["USA","New York","Fort Drum / Wheeler Sack AAF","Fort Drum / Wheeler Sack AAF, New York",599,2597,1295.4848999999999,0.94850000000000001,1.6877,33.782699999999998,0.17616000000000001,0.15056,6.6960000000000006E-2,-5.9,81.2,7672,404,7.84]
["USA","New York","Galloo Island","Galloo Island, New York",810,2779,1295.4848999999999,0.94850000000000001,1.6877,33.782699999999998,0.17616000000000001,0.15056,6.6960000000000006E-2,3.4,75.099999999999994,7133,341,7.84]
["USA","New York","Glens Falls","Glens Falls, New York",592,2593,1295.4848999999999,0.94850000000000001,1.6877,33.782699999999998,0.17616000000000001,0.15056,6.6960000000000006E-2,-3.5,82.2,7401,424,7.84]
["USA","New York","Griffiss AFB","Griffiss AFB, New York",620,2607,1295.4848999999999,0.94850000000000001,1.6877,33.782699999999998,0.17616000000000001,0.15056,6.6960000000000006E-2,-0.2,82.8,7081,460,7.84]
["USA","New York","Islip","Islip, New York",1078,2552,1295.4848999999999,0.94850000000000001,1.6877,33.782699999999998,0.17616000000000001,0.15056,6.6960000000000006E-2,15.1,82.7,5306,795,7.84]
["USA","New York","Jamestown","Jamestown, New York",510,2876,1295.4848999999999,0.94850000000000001,1.6877,33.782699999999998,0.17616000000000001,0.15056,6.6960000000000006E-2,5.0999999999999996,78.599999999999994,7177,289,7.84]
["USA","New York","Massena","Massena, New York",588,2600,1295.4848999999999,0.94850000000000001,1.6877,33.782699999999998,0.17616000000000001,0.15056,6.6960000000000006E-2,-8.9,82.1,8005,419,7.84]
["USA","New York","Monticello","Monticello, New York",526,2811,1295.4848999999999,0.94850000000000001,1.6877,33.782699999999998,0.17616000000000001,0.15056,6.6960000000000006E-2,3.4,80.8,7214,346,7.84]
["USA","New York","New York / J.F. Kennedy Int'l Airport","New York / J.F. Kennedy Int'l Airport, New York",1255,2424,1295.4848999999999,0.94850000000000001,1.6877,33.782699999999998,0.17616000000000001,0.15056,6.6960000000000006E-2,17.2,83.7,4828,978,7.84]
["USA","New York","New York / Laguardia Airport","New York / Laguardia Airport, New York",1344,2316,1295.4848999999999,0.94850000000000001,1.6877,33.782699999999998,0.17616000000000001,0.15056,6.6960000000000006E-2,17.3,86.6,4603,1210,7.84]
["USA","New York","Newburgh","Newburgh, New York",874,2544,1295.4848999999999,0.94850000000000001,1.6877,33.782699999999998,0.17616000000000001,0.15056,6.6960000000000006E-2,9,83.8,5935,685,7.84]
["USA","New York","Niagara Falls","Niagara Falls, New York",808,2712,1295.4848999999999,0.94850000000000001,1.6877,33.782699999999998,0.17616000000000001,0.15056,6.6960000000000006E-2,6.7,82.5,6589,589,7.84]
["USA","New York","Plattsburgh AFB","Plattsburgh AFB, New York",565,2678,1295.4848999999999,0.94850000000000001,1.6877,33.782699999999998,0.17616000000000001,0.15056,6.6960000000000006E-2,-5.0999999999999996,80.3,7823,360,7.84]
["USA","New York","Poughkeepsie","Poughkeepsie, New York",794,2527,1295.4848999999999,0.94850000000000001,1.6877,33.782699999999998,0.17616000000000001,0.15056,6.6960000000000006E-2,6,85.5,6212,678,7.84]
["USA","New York","Republic","Republic, New York",1174,2550,1295.4848999999999,0.94850000000000001,1.6877,33.782699999999998,0.17616000000000001,0.15056,6.6960000000000006E-2,17.600000000000001,83.7,5036,915,7.84]
["USA","New York","Rochester",{"$f":"C578&\", \"&B578","v":"Rochester, New York"},744,2676,1295.4848999999999,0.94850000000000001,1.6877,33.782699999999998,0.17616000000000001,0.15056,6.6960000000000006E-2,6,82.7,6579,549,7.84]
["USA","New York","Superior Shoals","Superior Shoals, New York",801,2604,1295.4848999999999,0.94850000000000001,1.6877,33.782699999999998,0.17616000000000001,0.15056,6.6960000000000006E-2,-0.5,77.5,7108,417,7.84]
["USA","New York","Syracuse","Syracuse, New York",742,2564,1295.4848999999999,0.94850000000000001,1.6877,33.782699999999998,0.17616000000000001,0.15056,6.6960000000000006E-2,2.9,83.3,6635,566,7.84]
["USA","New York","Utica","Utica, New York",675,2636,1295.4848999999999,0.94850000000000001,1.6877,33.782699999999998,0.17616000000000001,0.15056,6.6960000000000006E-2,0.8,82,7051,478,7.84]
["USA","New York","Watertown","Watertown, New York",565,2545,1295.4848999999999,0.94850000000000001,1.6877,33.782699999999998,0.17616000000000001,0.15056,6.6960000000000006E-2,-6.1,80.5,7541,365,7.84]
["USA","New York","White Plains","White Plains, New York",964,2524,1295.4848999999999,0.94850000000000001,1.6877,33.782699999999998,0.17616000000000001,0.15056,6.6960000000000006E-2,12.1,83.8,5563,755,7.84]
["USA","North Carolina","Asheville","Asheville, North Carolina",1070,2146,1856.1016999999999,1.4786999999999999,5.4164000000000003,31.008800000000001,0.10906,8.6639999999999995E-2,6.4229999999999995E-2,18.600000000000001,83.6,4148,829,8.6199999999999992]
["USA","North Carolina","Cape Hatteras","Cape Hatteras, North Carolina",2252,1842,1856.1016999999999,1.4786999999999999,5.4164000000000003,31.008800000000001,0.10906,8.6639999999999995E-2,6.4229999999999995E-2,32.200000000000003,83.8,2517,1764,8.6199999999999992]
["USA","North Carolina","Cape Lookout","Cape Lookout, North Carolina",2416,1619,1856.1016999999999,1.4786999999999999,5.4164000000000003,31.008800000000001,0.10906,8.6639999999999995E-2,6.4229999999999995E-2,32.200000000000003,83.2,2213,1832,8.6199999999999992]
["USA","North Carolina","Charlotte","Charlotte, North Carolina",1635,1830,1856.1016999999999,1.4786999999999999,5.4164000000000003,31.008800000000001,0.10906,8.6639999999999995E-2,6.4229999999999995E-2,24.6,89.5,3081,1669,8.6199999999999992]
["USA","North Carolina","Cherry Point","Cherry Point, North Carolina",1974,1587,1856.1016999999999,1.4786999999999999,5.4164000000000003,31.008800000000001,0.10906,8.6639999999999995E-2,6.4229999999999995E-2,27.4,88.8,2487,1958,8.6199999999999992]
["USA","North Carolina","Diamond Shoals","Diamond Shoals, North Carolina",2640,1400,1856.1016999999999,1.4786999999999999,5.4164000000000003,31.008800000000001,0.10906,8.6639999999999995E-2,6.4229999999999995E-2,34.5,82,1779,1870,8.6199999999999992]
["USA","North Carolina","Fayetteville","Fayetteville, North Carolina",1777,1687,1856.1016999999999,1.4786999999999999,5.4164000000000003,31.008800000000001,0.10906,8.6639999999999995E-2,6.4229999999999995E-2,25.6,90.9,2769,1918,8.6199999999999992]
["USA","North Carolina","Fort Bragg / Simmons","Fort Bragg / Simmons, North Carolina",1831,1698,1856.1016999999999,1.4786999999999999,5.4164000000000003,31.008800000000001,0.10906,8.6639999999999995E-2,6.4229999999999995E-2,26,91.3,2760,2007,8.6199999999999992]
["USA","North Carolina","Frying Pan Shoals","Frying Pan Shoals, North Carolina",3020,1058,1856.1016999999999,1.4786999999999999,5.4164000000000003,31.008800000000001,0.10906,8.6639999999999995E-2,6.4229999999999995E-2,38.9,83,1151,2265,8.6199999999999992]
["USA","North Carolina","Greensboro","Greensboro, North Carolina",1439,2033,1856.1016999999999,1.4786999999999999,5.4164000000000003,31.008800000000001,0.10906,8.6639999999999995E-2,6.4229999999999995E-2,21.7,87.8,3667,1367,8.6199999999999992]
["USA","North Carolina","Hatteras","Hatteras, North Carolina",2112,1709,1856.1016999999999,1.4786999999999999,5.4164000000000003,31.008800000000001,0.10906,8.6639999999999995E-2,6.4229999999999995E-2,30.8,85.2,2436,1778,8.6199999999999992]
["USA","North Carolina","Hickory","Hickory, North Carolina",1419,2013,1856.1016999999999,1.4786999999999999,5.4164000000000003,31.008800000000001,0.10906,8.6639999999999995E-2,6.4229999999999995E-2,23.3,87.9,3497,1354,8.6199999999999992]
["USA","North Carolina","Jacksonville","Jacksonville, North Carolina",1610,1783,1856.1016999999999,1.4786999999999999,5.4164000000000003,31.008800000000001,0.10906,8.6639999999999995E-2,6.4229999999999995E-2,24.7,90,2994,1677,8.6199999999999992]
["USA","North Carolina","New Bern","New Bern, North Carolina",1863,1634,1856.1016999999999,1.4786999999999999,5.4164000000000003,31.008800000000001,0.10906,8.6639999999999995E-2,6.4229999999999995E-2,26.4,89.6,2628,1910,8.6199999999999992]
["USA","North Carolina","New River Mcas","New River Mcas, North Carolina",1934,1571,1856.1016999999999,1.4786999999999999,5.4164000000000003,31.008800000000001,0.10906,8.6639999999999995E-2,6.4229999999999995E-2,26.8,89.2,2500,1950,8.6199999999999992]
["USA","North Carolina","Greenville","Greenville, North Carolina",1782,1720,1856.1016999999999,1.4786999999999999,5.4164000000000003,31.008800000000001,0.10906,8.6639999999999995E-2,6.4229999999999995E-2,24.9,91.1,2873,1938,8.6199999999999992]
["USA","North Carolina","Pope AFB","Pope AFB, North Carolina",1819,1696,1856.1016999999999,1.4786999999999999,5.4164000000000003,31.008800000000001,0.10906,8.6639999999999995E-2,6.4229999999999995E-2,25.2,91.6,2813,2016,8.6199999999999992]
["USA","North Carolina","Raleigh Durham International Airport","Raleigh Durham International Airport, North Carolina",1553,1903,1856.1016999999999,1.4786999999999999,5.4164000000000003,31.008800000000001,0.10906,8.6639999999999995E-2,6.4229999999999995E-2,23.1,89.4,3322,1579,8.6199999999999992]
["USA","North Carolina","Richmond","Richmond, North Carolina",1441,2042,1856.1016999999999,1.4786999999999999,5.4164000000000003,31.008800000000001,0.10906,8.6639999999999995E-2,6.4229999999999995E-2,20.8,89.8,3760,1489,8.6199999999999992]
["USA","North Carolina","Seymour - Johnson AFB","Seymour - Johnson AFB, North Carolina",1799,1681,1856.1016999999999,1.4786999999999999,5.4164000000000003,31.008800000000001,0.10906,8.6639999999999995E-2,6.4229999999999995E-2,26.2,91.1,2717,1956,8.6199999999999992]
["USA","North Carolina","Southern Pines","Southern Pines, North Carolina",1537,1850,1856.1016999999999,1.4786999999999999,5.4164000000000003,31.008800000000001,0.10906,8.6639999999999995E-2,6.4229999999999995E-2,23,90.2,3238,1614,8.6199999999999992]
["USA","North Carolina","Wilmington","Wilmington, North Carolina",1987,1532,1856.1016999999999,1.4786999999999999,5.4164000000000003,31.008800000000001,0.10906,8.6639999999999995E-2,6.4229999999999995E-2,27.6,89,2388,1987,8.6199999999999992]
["USA","North Carolina","Winston-Salem","Winston-Salem, North Carolina",1485,1965,1856.1016999999999,1.4786999999999999,5.4164000000000003,31.008800000000001,0.10906,8.6639999999999995E-2,6.4229999999999995E-2,22.8,88.1,3455,1429,8.6199999999999992]
["USA","North Dakota","Bismarck","Bismarck, North Dakota",593,2577,2458.3344000000002,6.1463000000000001,12.5496,28.949200000000001,9.06E-2,8.0229999999999996E-2,6.5519999999999995E-2,-13.9,86.8,8471,539,6.04]
["USA","North Dakota","Devils Lake","Devils Lake, North Dakota",589,2701,2458.3344000000002,6.1463000000000001,12.5496,28.949200000000001,9.06E-2,8.0229999999999996E-2,6.5519999999999995E-2,-19,83.8,9455,461,6.04]
["USA","North Dakota","Dickinson","Dickinson, North Dakota",494,2582,2458.3344000000002,6.1463000000000001,12.5496,28.949200000000001,9.06E-2,8.0229999999999996E-2,6.5519999999999995E-2,-12.6,86,8349,432,6.04]
["USA","North Dakota","Fargo Hector","Fargo Hector, North Dakota",674,2631,2458.3344000000002,6.1463000000000001,12.5496,28.949200000000001,9.06E-2,8.0229999999999996E-2,6.5519999999999995E-2,-15.2,84.7,8793,553,6.04]
["USA","North Dakota","Grand Forks","Grand Forks, North Dakota",557,2718,2458.3344000000002,6.1463000000000001,12.5496,28.949200000000001,9.06E-2,8.0229999999999996E-2,6.5519999999999995E-2,-17.2,83.7,9310,434,6.04]
["USA","North Dakota","Jamestown","Jamestown, North Dakota",610,2657,2458.3344000000002,6.1463000000000001,12.5496,28.949200000000001,9.06E-2,8.0229999999999996E-2,6.5519999999999995E-2,-14.9,84.7,8845,501,6.04]
["USA","North Dakota","Lidgerwood","Lidgerwood, North Dakota",654,2629,2458.3344000000002,6.1463000000000001,12.5496,28.949200000000001,9.06E-2,8.0229999999999996E-2,6.5519999999999995E-2,-13.9,85.3,8642,553,6.04]
["USA","North Dakota","Minot AFB","Minot AFB, North Dakota",504,2653,2458.3344000000002,6.1463000000000001,12.5496,28.949200000000001,9.06E-2,8.0229999999999996E-2,6.5519999999999995E-2,-17.3,85.6,9097,433,6.04]
["USA","North Dakota","Williston","Williston, North Dakota",535,2545,2458.3344000000002,6.1463000000000001,12.5496,28.949200000000001,9.06E-2,8.0229999999999996E-2,6.5519999999999995E-2,-17.899999999999999,87.1,8790,493,6.04]
["USA","Ohio","Akron","Akron, Ohio",887,2505,1954.1411000000001,2.3595000000000002,13.0787,23.581099999999999,0.11759,9.4719999999999999E-2,6.2350000000000003E-2,7.1,83.3,6044,676,7.11]
["USA","Ohio","Cincinnati","Cincinnati, Ohio",1206,2169,1954.1411000000001,2.3595000000000002,13.0787,23.581099999999999,0.11759,9.4719999999999999E-2,6.2350000000000003E-2,12.4,87.9,4754,1151,7.11]
["USA","Ohio","Cleveland","Cleveland, Ohio",934,2508,1954.1411000000001,2.3595000000000002,13.0787,23.581099999999999,0.11759,9.4719999999999999E-2,6.2350000000000003E-2,8.5,84.1,5904,743,7.11]
["USA","Ohio","Columbus","Columbus, Ohio",1094,2285,1954.1411000000001,2.3595000000000002,13.0787,23.581099999999999,0.11759,9.4719999999999999E-2,6.2350000000000003E-2,9.1,86.3,5322,971,7.11]
["USA","Ohio","Dayton","Dayton, Ohio",1087,2292,1954.1411000000001,2.3595000000000002,13.0787,23.581099999999999,0.11759,9.4719999999999999E-2,6.2350000000000003E-2,6.9,85.4,5549,924,7.11]
["USA","Ohio","Findlay","Findlay, Ohio",942,2422,1954.1411000000001,2.3595000000000002,13.0787,23.581099999999999,0.11759,9.4719999999999999E-2,6.2350000000000003E-2,5.6,84.8,5994,777,7.11]
["USA","Ohio","Lancaster","Lancaster, Ohio",904,2384,1954.1411000000001,2.3595000000000002,13.0787,23.581099999999999,0.11759,9.4719999999999999E-2,6.2350000000000003E-2,9.9,85.6,5474,776,7.11]
["USA","Ohio","Mansfield","Mansfield, Ohio",874,2489,1954.1411000000001,2.3595000000000002,13.0787,23.581099999999999,0.11759,9.4719999999999999E-2,6.2350000000000003E-2,5.7,83.1,6150,659,7.11]
["USA","Ohio","Ohio State University","Ohio State University, Ohio",1063,2406,1954.1411000000001,2.3595000000000002,13.0787,23.581099999999999,0.11759,9.4719999999999999E-2,6.2350000000000003E-2,11.7,85.3,5343,899,7.11]
["USA","Ohio","Rickenbacker Air National Guard","Rickenbacker Air National Guard, Ohio",1087,2269,1954.1411000000001,2.3595000000000002,13.0787,23.581099999999999,0.11759,9.4719999999999999E-2,6.2350000000000003E-2,10.3,87.7,5172,1028,7.11]
["USA","Ohio","South Bass Island","South Bass Island, Ohio",1273,2689,1954.1411000000001,2.3595000000000002,13.0787,23.581099999999999,0.11759,9.4719999999999999E-2,6.2350000000000003E-2,11.8,80.5,5960,822,7.11]
["USA","Ohio","Toledo","Toledo, Ohio",896,2475,1954.1411000000001,2.3595000000000002,13.0787,23.581099999999999,0.11759,9.4719999999999999E-2,6.2350000000000003E-2,5.3,85.7,6156,773,7.11]
["USA","Ohio","Wright - Paterson AFB","Wright - Paterson AFB, Ohio",1092,2286,1954.1411000000001,2.3595000000000002,13.0787,23.581099999999999,0.11759,9.4719999999999999E-2,6.2350000000000003E-2,8.5,86.4,5381,974,7.11]
["USA","Ohio","Youngstown","Youngstown, Ohio",753,2577,1954.1411000000001,2.3595000000000002,13.0787,23.581099999999999,0.11759,9.4719999999999999E-2,6.2350000000000003E-2,7.1,83.4,6218,577,7.11]
["USA","Ohio","Zanesville","Zanesville, Ohio",971,2342,1954.1411000000001,2.3595000000000002,13.0787,23.581099999999999,0.11759,9.4719999999999999E-2,6.2350000000000003E-2,9.5,85.2,5417,817,7.11]
["USA","Oklahoma","Altus AFB","Altus AFB, Oklahoma",1676,1655,1396.0881999999999,1.9653,1.7166999999999999,22.645499999999998,9.5060000000000006E-2,7.3200000000000001E-2,5.0869999999999999E-2,19.7,98.4,3124,2333,8.9499999999999993]
["USA","Oklahoma","Clinton","Clinton, Oklahoma",1581,1807,1396.0881999999999,1.9653,1.7166999999999999,22.645499999999998,9.5060000000000006E-2,7.3200000000000001E-2,5.0869999999999999E-2,19.399999999999999,97.2,3433,2121,8.9499999999999993]
["USA","Oklahoma","Fort Sill","Fort Sill, Oklahoma",1661,1701,1396.0881999999999,1.9653,1.7166999999999999,22.645499999999998,9.5060000000000006E-2,7.3200000000000001E-2,5.0869999999999999E-2,18.899999999999999,95.5,3268,2111,8.9499999999999993]
["USA","Oklahoma","Gage","Gage, Oklahoma",1342,1938,1396.0881999999999,1.9653,1.7166999999999999,22.645499999999998,9.5060000000000006E-2,7.3200000000000001E-2,5.0869999999999999E-2,12.6,94.8,4232,1666,8.9499999999999993]
["USA","Oklahoma","Hobart","Hobart, Oklahoma",1581,1825,1396.0881999999999,1.9653,1.7166999999999999,22.645499999999998,9.5060000000000006E-2,7.3200000000000001E-2,5.0869999999999999E-2,18.600000000000001,97,3529,2108,8.9499999999999993]
["USA","Oklahoma","Lawton","Lawton, Oklahoma",1592,1717,1396.0881999999999,1.9653,1.7166999999999999,22.645499999999998,9.5060000000000006E-2,7.3200000000000001E-2,5.0869999999999999E-2,20.8,98.9,3163,2248,8.9499999999999993]
["USA","Oklahoma","Mcalester","Mcalester, Oklahoma",1726,1643,1396.0881999999999,1.9653,1.7166999999999999,22.645499999999998,9.5060000000000006E-2,7.3200000000000001E-2,5.0869999999999999E-2,19.399999999999999,93.5,3122,2050,8.9499999999999993]
["USA","Oklahoma","Oklahoma City Will Rogers World Airport","Oklahoma City Will Rogers World Airport, Oklahoma",1594,1773,1396.0881999999999,1.9653,1.7166999999999999,22.645499999999998,9.5060000000000006E-2,7.3200000000000001E-2,5.0869999999999999E-2,17.399999999999999,94,3516,1926,8.9499999999999993]
["USA","Oklahoma","Oklahoma City / Wiley Post Airport","Oklahoma City / Wiley Post Airport, Oklahoma",1681,1780,1396.0881999999999,1.9653,1.7166999999999999,22.645499999999998,9.5060000000000006E-2,7.3200000000000001E-2,5.0869999999999999E-2,17.899999999999999,94.2,3493,2045,8.9499999999999993]
["USA","Oklahoma","Ponca City","Ponca City, Oklahoma",1600,1824,1396.0881999999999,1.9653,1.7166999999999999,22.645499999999998,9.5060000000000006E-2,7.3200000000000001E-2,5.0869999999999999E-2,15.1,95.1,3792,2007,8.9499999999999993]
["USA","Oklahoma","Stillwater","Stillwater, Oklahoma",1505,1831,1396.0881999999999,1.9653,1.7166999999999999,22.645499999999998,9.5060000000000006E-2,7.3200000000000001E-2,5.0869999999999999E-2,18.2,96.6,3571,1982,8.9499999999999993]
["USA","Oklahoma","Tinker AFB",{"$f":"C642&\", \"&B642","v":"Tinker AFB, Oklahoma"},1654,1736,1396.0881999999999,1.9653,1.7166999999999999,22.645499999999998,9.5060000000000006E-2,7.3200000000000001E-2,5.0869999999999999E-2,17.899999999999999,93.6,3407,1971,8.9499999999999993]
["USA","Oklahoma","Tulsa International Airport","Tulsa International Airport, Oklahoma",1693,1740,1396.0881999999999,1.9653,1.7166999999999999,22.645499999999998,9.5060000000000006E-2,7.3200000000000001E-2,5.0869999999999999E-2,16.8,94.2,3494,2060,8.9499999999999993]
["USA","Oklahoma","Tulsa / Lloyd Jones Airport","Tulsa / Lloyd Jones Airport, Oklahoma",1582,1808,1396.0881999999999,1.9653,1.7166999999999999,22.645499999999998,9.5060000000000006E-2,7.3200000000000001E-2,5.0869999999999999E-2,18.8,95.4,3481,2004,8.9499999999999993]
["USA","Oklahoma","Vance AFB / Enid","Vance AFB / Enid, Oklahoma",1497,1848,1396.0881999999999,1.9653,1.7166999999999999,22.645499999999998,9.5060000000000006E-2,7.3200000000000001E-2,5.0869999999999999E-2,13.1,95.5,3996,1903,8.9499999999999993]
["USA","Oregon","Astoria","Astoria, Oregon",91,3407,980.52080000000001,0.93530000000000002,1.1007,57.153599999999997,9.8049999999999998E-2,8.3110000000000003E-2,5.5870000000000003E-2,30.1,69.2,4955,16,8.91]
["USA","Oregon","Aurora State","Aurora State, Oregon",489,2946,980.52080000000001,0.93530000000000002,1.1007,57.153599999999997,9.8049999999999998E-2,8.3110000000000003E-2,5.5870000000000003E-2,29.7,83.9,4333,385,8.91]
["USA","Oregon","Baker","Baker, Oregon",268,2933,980.52080000000001,0.93530000000000002,1.1007,57.153599999999997,9.8049999999999998E-2,8.3110000000000003E-2,5.5870000000000003E-2,6.6,86.1,7138,236,8.91]
["USA","Oregon","Burns","Burns, Oregon",252,3052,980.52080000000001,0.93530000000000002,1.1007,57.153599999999997,9.8049999999999998E-2,8.3110000000000003E-2,5.5870000000000003E-2,6.1,87.1,7491,232,8.91]
["USA","Oregon","Cape Arago","Cape Arago, Oregon",0,4240,980.52080000000001,0.93530000000000002,1.1007,57.153599999999997,9.8049999999999998E-2,8.3110000000000003E-2,5.5870000000000003E-2,37.299999999999997,62,4894,1,8.91]
["USA","Oregon","Corvallis","Corvallis, Oregon",478,2705,980.52080000000001,0.93530000000000002,1.1007,57.153599999999997,9.8049999999999998E-2,8.3110000000000003E-2,5.5870000000000003E-2,27.7,85.7,4204,412,8.91]
["USA","Oregon","Eugene","Eugene, Oregon",329,2900,980.52080000000001,0.93530000000000002,1.1007,57.153599999999997,9.8049999999999998E-2,8.3110000000000003E-2,5.5870000000000003E-2,26.3,83.9,4676,259,8.91]
["USA","Oregon","Klamath Falls","Klamath Falls, Oregon",300,3039,980.52080000000001,0.93530000000000002,1.1007,57.153599999999997,9.8049999999999998E-2,8.3110000000000003E-2,5.5870000000000003E-2,11.9,84.7,6723,246,8.91]
["USA","Oregon","La Grande","La Grande, Oregon",331,3018,980.52080000000001,0.93530000000000002,1.1007,57.153599999999997,9.8049999999999998E-2,8.3110000000000003E-2,5.5870000000000003E-2,14.9,86.3,6300,294,8.91]
["USA","Oregon","Lakeview","Lakeview, Oregon",204,3172,980.52080000000001,0.93530000000000002,1.1007,57.153599999999997,9.8049999999999998E-2,8.3110000000000003E-2,5.5870000000000003E-2,8.6999999999999993,83.6,7440,158,8.91]
["USA","Oregon","Mc Minnville","Mc Minnville, Oregon",377,3108,980.52080000000001,0.93530000000000002,1.1007,57.153599999999997,9.8049999999999998E-2,8.3110000000000003E-2,5.5870000000000003E-2,29.8,84.1,4559,300,8.91]
["USA","Oregon","Meacham","Meacham, Oregon",46,3247,980.52080000000001,0.93530000000000002,1.1007,57.153599999999997,9.8049999999999998E-2,8.3110000000000003E-2,5.5870000000000003E-2,2.2000000000000002,80.8,8497,30,8.91]
["USA","Oregon","Medford","Medford, Oregon",705,2640,980.52080000000001,0.93530000000000002,1.1007,57.153599999999997,9.8049999999999998E-2,8.3110000000000003E-2,5.5870000000000003E-2,25.7,91.9,4323,790,8.91]
["USA","Oregon","North Bend","North Bend, Oregon",31,3435,980.52080000000001,0.93530000000000002,1.1007,57.153599999999997,9.8049999999999998E-2,8.3110000000000003E-2,5.5870000000000003E-2,33.700000000000003,67.3,4480,3,8.91]
["USA","Oregon","Pendleton","Pendleton, Oregon",635,2506,980.52080000000001,0.93530000000000002,1.1007,57.153599999999997,9.8049999999999998E-2,8.3110000000000003E-2,5.5870000000000003E-2,14.9,89.7,5232,654,8.91]
["USA","Oregon","Portland","Portland, Oregon",552,2784,980.52080000000001,0.93530000000000002,1.1007,57.153599999999997,9.8049999999999998E-2,8.3110000000000003E-2,5.5870000000000003E-2,28.6,83.4,4222,423,8.91]
["USA","Oregon","Hillsboro","Hillsboro, Oregon",356,2969,980.52080000000001,0.93530000000000002,1.1007,57.153599999999997,9.8049999999999998E-2,8.3110000000000003E-2,5.5870000000000003E-2,26.6,83.9,4750,280,8.91]
["USA","Oregon","Redmond","Redmond, Oregon",256,2956,980.52080000000001,0.93530000000000002,1.1007,57.153599999999997,9.8049999999999998E-2,8.3110000000000003E-2,5.5870000000000003E-2,11.9,86.5,6540,229,8.91]
["USA","Oregon","Salem","Salem, Oregon",367,2831,980.52080000000001,0.93530000000000002,1.1007,57.153599999999997,9.8049999999999998E-2,8.3110000000000003E-2,5.5870000000000003E-2,26.2,84.1,4576,292,8.91]
["USA","Pennsylvania","Allentown","Allentown, Pennsylvania",965,2496,1660.5617,1.76,9.4047000000000001,28.617599999999999,0.1275,9.4369999999999996E-2,7.2279999999999997E-2,11.5,85.6,5564,828,10.24]
["USA","Pennsylvania","Altoona","Altoona, Pennsylvania",823,2582,1660.5617,1.76,9.4047000000000001,28.617599999999999,0.1275,9.4369999999999996E-2,7.2279999999999997E-2,9.6,83,5959,617,10.24]
["USA","Pennsylvania","Bradford","Bradford, Pennsylvania",378,2890,1660.5617,1.76,9.4047000000000001,28.617599999999999,0.1275,9.4369999999999996E-2,7.2279999999999997E-2,2.2999999999999998,78.7,7550,216,10.24]
["USA","Pennsylvania","Butler","Butler, Pennsylvania",751,2609,1660.5617,1.76,9.4047000000000001,28.617599999999999,0.1275,9.4369999999999996E-2,7.2279999999999997E-2,8.9,82.1,6098,535,10.24]
["USA","Pennsylvania","Dubois","Dubois, Pennsylvania",630,2695,1660.5617,1.76,9.4047000000000001,28.617599999999999,0.1275,9.4369999999999996E-2,7.2279999999999997E-2,5,80.7,6737,412,10.24]
["USA","Pennsylvania","Erie","Erie, Pennsylvania",924,2644,1660.5617,1.76,9.4047000000000001,28.617599999999999,0.1275,9.4369999999999996E-2,7.2279999999999997E-2,9.6999999999999993,81.7,6092,643,10.24]
["USA","Pennsylvania","Franklin","Franklin, Pennsylvania",614,2711,1660.5617,1.76,9.4047000000000001,28.617599999999999,0.1275,9.4369999999999996E-2,7.2279999999999997E-2,6.2,80.900000000000006,6641,407,10.24]
["USA","Pennsylvania","Harrisburg","Harrisburg, Pennsylvania",1095,2427,1660.5617,1.76,9.4047000000000001,28.617599999999999,0.1275,9.4369999999999996E-2,7.2279999999999997E-2,13.3,86.7,5228,990,10.24]
["USA","Pennsylvania","Johnstown","Johnstown, Pennsylvania",750,2641,1660.5617,1.76,9.4047000000000001,28.617599999999999,0.1275,9.4369999999999996E-2,7.2279999999999997E-2,7.1,80.099999999999994,6371,472,10.24]
["USA","Pennsylvania","Middletown","Middletown, Pennsylvania",1215,2407,1660.5617,1.76,9.4047000000000001,28.617599999999999,0.1275,9.4369999999999996E-2,7.2279999999999997E-2,14.8,87,5035,1114,10.24]
["USA","Pennsylvania","Philadelphia","Philadelphia, Pennsylvania",1328,2285,1660.5617,1.76,9.4047000000000001,28.617599999999999,0.1275,9.4369999999999996E-2,7.2279999999999997E-2,16.899999999999999,88,4579,1273,10.24]
["USA","Pennsylvania","Pittsburgh","Pittsburgh, Pennsylvania",1071,2329,1660.5617,1.76,9.4047000000000001,28.617599999999999,0.1275,9.4369999999999996E-2,7.2279999999999997E-2,9.8000000000000007,84.6,5356,875,10.24]
["USA","Pennsylvania","Pittsburgh International Airport","Pittsburgh International Airport, Pennsylvania",939,2428,1660.5617,1.76,9.4047000000000001,28.617599999999999,0.1275,9.4369999999999996E-2,7.2279999999999997E-2,9.4,84.2,5624,751,10.24]
["USA","Pennsylvania","Reading","Reading, Pennsylvania",1056,2414,1660.5617,1.76,9.4047000000000001,28.617599999999999,0.1275,9.4369999999999996E-2,7.2279999999999997E-2,13.4,86.5,5191,946,10.24]
["USA","Pennsylvania","Washington","Washington, Pennsylvania",731,2557,1660.5617,1.76,9.4047000000000001,28.617599999999999,0.1275,9.4369999999999996E-2,7.2279999999999997E-2,8.8000000000000007,82.8,5988,542,10.24]
["USA","Pennsylvania","Scranton","Scranton, Pennsylvania",820,2584,1660.5617,1.76,9.4047000000000001,28.617599999999999,0.1275,9.4369999999999996E-2,7.2279999999999997E-2,8.3000000000000007,83.3,6105,625,10.24]
["USA","Pennsylvania","Williamsport","Williamsport, Pennsylvania",863,2558,1660.5617,1.76,9.4047000000000001,28.617599999999999,0.1275,9.4369999999999996E-2,7.2279999999999997E-2,9.4,84.8,5925,712,10.24]
["USA","Pennsylvania","Willow Grove","Willow Grove, Pennsylvania",1135,2352,1660.5617,1.76,9.4047000000000001,28.617599999999999,0.1275,9.4369999999999996E-2,7.2279999999999997E-2,14.4,87.4,4959,1059,10.24]
["USA","Rhode Island","Block Island","Block Island, Rhode Island",917,2673,938.69629999999995,0.2505,1.29E-2,18.536899999999999,0.14404,0.11867,0.10677,16.2,77.2,5435,466,12.31]
["USA","Rhode Island","Pawtucket","Pawtucket, Rhode Island",706,2681,938.69629999999995,0.2505,1.29E-2,18.536899999999999,0.14404,0.11867,0.10677,8.9,81.599999999999994,6267,488,12.31]
["USA","Rhode Island","Providence","Providence, Rhode Island",931,2527,938.69629999999995,0.2505,1.29E-2,18.536899999999999,0.14404,0.11867,0.10677,11.9,83.8,5591,729,12.31]
["USA","South Carolina","Anderson","Anderson, South Carolina",1588,1792,1647.3059000000001,1.2776000000000001,5.6970999999999998,30.3127,0.11768000000000001,9.6280000000000004E-2,6.021E-2,25.7,90.3,2934,1674,8.67]
["USA","South Carolina","Beaufort","Beaufort, South Carolina",2297,1277,1647.3059000000001,1.2776000000000001,5.6970999999999998,30.3127,0.11768000000000001,9.6280000000000004E-2,6.021E-2,31.2,90.7,1798,2460,8.67]
["USA","South Carolina","Charleston","Charleston, South Carolina",2217,1310,1647.3059000000001,1.2776000000000001,5.6970999999999998,30.3127,0.11768000000000001,9.6280000000000004E-2,6.021E-2,30.4,90.2,1889,2328,8.67]
["USA","South Carolina","Columbia","Columbia, South Carolina",1853,1552,1647.3059000000001,1.2776000000000001,5.6970999999999998,30.3127,0.11768000000000001,9.6280000000000004E-2,6.021E-2,25.9,92.3,2529,2108,8.67]
["USA","South Carolina","Florence","Florence, South Carolina",1890,1532,1647.3059000000001,1.2776000000000001,5.6970999999999998,30.3127,0.11768000000000001,9.6280000000000004E-2,6.021E-2,26.9,91.2,2432,2063,8.67]
["USA","South Carolina","Folly Island","Folly Island, South Carolina",2523,1517,1647.3059000000001,1.2776000000000001,5.6970999999999998,30.3127,0.11768000000000001,9.6280000000000004E-2,6.021E-2,34.9,85.1,1902,2113,8.67]
["USA","South Carolina","Greenville - Spartanburg Int'l Airport","Greenville - Spartanburg Int'l Airport, South Carolina",1555,1860,1647.3059000000001,1.2776000000000001,5.6970999999999998,30.3127,0.11768000000000001,9.6280000000000004E-2,6.021E-2,24.7,89.1,3123,1561,8.67]
["USA","South Carolina","Myrtle Beach","Myrtle Beach, South Carolina",2063,1523,1647.3059000000001,1.2776000000000001,5.6970999999999998,30.3127,0.11768000000000001,9.6280000000000004E-2,6.021E-2,28.4,88.2,2322,1994,8.67]
["USA","South Carolina","Shaw AFB / Sumter","Shaw AFB / Sumter, South Carolina",1839,1583,1647.3059000000001,1.2776000000000001,5.6970999999999998,30.3127,0.11768000000000001,9.6280000000000004E-2,6.021E-2,27.5,90.6,2474,1962,8.67]
["USA","South Dakota","Aberdeen","Aberdeen, South Dakota",699,2544,2388.1241,7.4143999999999997,5.9687999999999999,30.155899999999999,0.10067,8.097E-2,6.5710000000000005E-2,-12.3,85.8,8194,606,6.45]
["USA","South Dakota","Brookings","Brookings, South Dakota",677,2642,2388.1241,7.4143999999999997,5.9687999999999999,30.155899999999999,0.10067,8.097E-2,6.5710000000000005E-2,-9.6,82.3,8211,488,6.45]
["USA","South Dakota","Buffalo","Buffalo, South Dakota",596,2471,2388.1241,7.4143999999999997,5.9687999999999999,30.155899999999999,0.10067,8.097E-2,6.5710000000000005E-2,-8.6999999999999993,88.6,7587,586,6.45]
["USA","South Dakota","Chamberlain","Chamberlain, South Dakota",854,2400,2388.1241,7.4143999999999997,5.9687999999999999,30.155899999999999,0.10067,8.097E-2,6.5710000000000005E-2,-4.7,90,6971,890,6.45]
["USA","South Dakota","Chan Gurney","Chan Gurney, South Dakota",897,2418,2388.1241,7.4143999999999997,5.9687999999999999,30.155899999999999,0.10067,8.097E-2,6.5710000000000005E-2,-3.3,86.7,6882,811,6.45]
["USA","South Dakota","Custer","Custer, South Dakota",265,2987,2388.1241,7.4143999999999997,5.9687999999999999,30.155899999999999,0.10067,8.097E-2,6.5710000000000005E-2,-1.8,81.099999999999994,8315,178,6.45]
["USA","South Dakota","Ellsworth AFB","Ellsworth AFB, South Dakota",702,2449,2388.1241,7.4143999999999997,5.9687999999999999,30.155899999999999,0.10067,8.097E-2,6.5710000000000005E-2,-3.6,88.8,6999,696,6.45]
["USA","South Dakota","Huron","Huron, South Dakota",809,2449,2388.1241,7.4143999999999997,5.9687999999999999,30.155899999999999,0.10067,8.097E-2,6.5710000000000005E-2,-9.6,87.8,7611,769,6.45]
["USA","South Dakota","Mitchell","Mitchell, South Dakota",829,2451,2388.1241,7.4143999999999997,5.9687999999999999,30.155899999999999,0.10067,8.097E-2,6.5710000000000005E-2,-6.2,87.8,7270,788,6.45]
["USA","South Dakota","Mobridge","Mobridge, South Dakota",790,2485,2388.1241,7.4143999999999997,5.9687999999999999,30.155899999999999,0.10067,8.097E-2,6.5710000000000005E-2,-10.1,88.1,7777,760,6.45]
["USA","South Dakota","Pierre","Pierre, South Dakota",854,2389,2388.1241,7.4143999999999997,5.9687999999999999,30.155899999999999,0.10067,8.097E-2,6.5710000000000005E-2,-6.4,91.3,7107,936,6.45]
["USA","South Dakota","Rapid City",{"$f":"C706&\", \"&B706","v":"Rapid City, South Dakota"},670,2423,2388.1241,7.4143999999999997,5.9687999999999999,30.155899999999999,0.10067,8.097E-2,6.5710000000000005E-2,-4.5999999999999996,89.3,7027,678,6.45]
["USA","South Dakota","Sioux Falls","Sioux Falls, South Dakota",848,2460,2388.1241,7.4143999999999997,5.9687999999999999,30.155899999999999,0.10067,8.097E-2,6.5710000000000005E-2,-8.4,86.3,7524,753,6.45]
["USA","South Dakota","Watertown","Watertown, South Dakota",683,2631,2388.1241,7.4143999999999997,5.9687999999999999,30.155899999999999,0.10067,8.097E-2,6.5710000000000005E-2,-11.7,83.9,8409,538,6.45]
["USA","Tennessee","Bristol / Tri-City Airport","Bristol / Tri-City Airport, Tennessee",1172,2113,2049.5315999999998,1.6586000000000001,6.9081999999999999,24.309799999999999,0.10101,0.10308,7.077E-2,16.899999999999999,85.4,4234,996,8.36]
["USA","Tennessee","Chattanooga","Chattanooga, Tennessee",1619,1797,2049.5315999999998,1.6586000000000001,6.9081999999999999,24.309799999999999,0.10101,0.10308,7.077E-2,22.3,89.9,3197,1680,8.36]
["USA","Tennessee","Crossville","Crossville, Tennessee",1168,2057,2049.5315999999998,1.6586000000000001,6.9081999999999999,24.309799999999999,0.10101,0.10308,7.077E-2,15.4,84,4251,925,8.36]
["USA","Tennessee","Dyersburg","Dyersburg, Tennessee",1601,1854,2049.5315999999998,1.6586000000000001,6.9081999999999999,24.309799999999999,0.10101,0.10308,7.077E-2,19.2,90.4,3539,1694,8.36]
["USA","Tennessee","Jackson","Jackson, Tennessee",1620,1783,2049.5315999999998,1.6586000000000001,6.9081999999999999,24.309799999999999,0.10101,0.10308,7.077E-2,18.7,90.6,3439,1728,8.36]
["USA","Tennessee","Knoxville","Knoxville, Tennessee",1508,1936,2049.5315999999998,1.6586000000000001,6.9081999999999999,24.309799999999999,0.10101,0.10308,7.077E-2,20.2,88.1,3614,1451,8.36]
["USA","Tennessee","Memphis","Memphis, Tennessee",1961,1627,2049.5315999999998,1.6586000000000001,6.9081999999999999,24.309799999999999,0.10101,0.10308,7.077E-2,21.7,92.1,2935,2214,8.36]
["USA","Tennessee","Millington","Millington, Tennessee",1767,1684,2049.5315999999998,1.6586000000000001,6.9081999999999999,24.309799999999999,0.10101,0.10308,7.077E-2,19.600000000000001,92.8,3185,2047,8.36]
["USA","Tennessee","NAShville","NAShville, Tennessee",1616,1816,2049.5315999999998,1.6586000000000001,6.9081999999999999,24.309799999999999,0.10101,0.10308,7.077E-2,18.2,90,3542,1683,8.36]
["USA","Texas","Abilene","Abilene, Texas",1926,1457,1194.1351,0.7107,0.71230000000000004,20.468299999999999,0.10979999999999999,8.1570000000000004E-2,5.5710000000000003E-2,22.2,96.9,2599,2560,6.63]
["USA","Texas","Abilene","Abilene, Texas",1915,1460,1194.1351,0.7107,0.71230000000000004,20.468299999999999,0.10979999999999999,8.1570000000000004E-2,5.5710000000000003E-2,23.3,95.1,2537,2402,6.63]
["USA","Texas","Amarillo","Amarillo, Texas",1204,1964,1194.1351,0.7107,0.71230000000000004,20.468299999999999,0.10979999999999999,8.1570000000000004E-2,5.5710000000000003E-2,13.7,92.3,4198,1369,6.63]
["USA","Texas","Austin / Bergstrom","Austin / Bergstrom, Texas",2322,1121,1194.1351,0.7107,0.71230000000000004,20.468299999999999,0.10979999999999999,8.1570000000000004E-2,5.5710000000000003E-2,29.6,95.9,1654,2989,6.63]
["USA","Texas","Brownsville / South Padre Island","Brownsville / South Padre Island, Texas",3397,560,1194.1351,0.7107,0.71230000000000004,20.468299999999999,0.10979999999999999,8.1570000000000004E-2,5.5710000000000003E-2,40.799999999999997,93.2,565,3991,6.63]
["USA","Texas","Camp Mabry","Camp Mabry, Texas",2403,1100,1194.1351,0.7107,0.71230000000000004,20.468299999999999,0.10979999999999999,8.1570000000000004E-2,5.5710000000000003E-2,31.3,95.5,1545,3054,6.63]
["USA","Texas","College Station","College Station, Texas",2373,1126,1194.1351,0.7107,0.71230000000000004,20.468299999999999,0.10979999999999999,8.1570000000000004E-2,5.5710000000000003E-2,30.3,95.1,1628,2976,6.63]
["USA","Texas","Corpus Christi","Corpus Christi, Texas",2994,766,1194.1351,0.7107,0.71230000000000004,20.468299999999999,0.10979999999999999,8.1570000000000004E-2,5.5710000000000003E-2,37.1,93,891,3493,6.63]
["USA","Texas","Dallas Hensley Field NAS","Dallas Hensley Field NAS, Texas",2151,1372,1194.1351,0.7107,0.71230000000000004,20.468299999999999,0.10979999999999999,8.1570000000000004E-2,5.5710000000000003E-2,25.6,95.5,2252,2733,6.63]
["USA","Texas","Dallas Love Field","Dallas Love Field, Texas",2214,1344,1194.1351,0.7107,0.71230000000000004,20.468299999999999,0.10979999999999999,8.1570000000000004E-2,5.5710000000000003E-2,27.4,96.7,2105,2924,6.63]
["USA","Texas","Dallas Executive Airport","Dallas Executive Airport, Texas",2064,1372,1194.1351,0.7107,0.71230000000000004,20.468299999999999,0.10979999999999999,8.1570000000000004E-2,5.5710000000000003E-2,28.1,96.9,2109,2744,6.63]
["USA","Texas","Dallas-Fort Worth Int'l Airport","Dallas-Fort Worth Int'l Airport, Texas",2092,1393,1194.1351,0.7107,0.71230000000000004,20.468299999999999,0.10979999999999999,8.1570000000000004E-2,5.5710000000000003E-2,25.8,96.2,2275,2719,6.63]
["USA","Texas","Del Rio International Airport","Del Rio International Airport, Texas",2540,993,1194.1351,0.7107,0.71230000000000004,20.468299999999999,0.10979999999999999,8.1570000000000004E-2,5.5710000000000003E-2,34.200000000000003,97.6,1274,3450,6.63]
["USA","Texas","Draughon Miller Central Airport","Draughon Miller Central Airport, Texas",2147,1278,1194.1351,0.7107,0.71230000000000004,20.468299999999999,0.10979999999999999,8.1570000000000004E-2,5.5710000000000003E-2,28.3,95.5,1954,2728,6.63]
["USA","Texas","El Paso International Airport","El Paso International Airport, Texas",1791,1533,1194.1351,0.7107,0.71230000000000004,20.468299999999999,0.10979999999999999,8.1570000000000004E-2,5.5710000000000003E-2,26.4,96,2466,2314,6.63]
["USA","Texas","Fort Hood / Gray AAF","Fort Hood / Gray AAF, Texas",2195,1220,1194.1351,0.7107,0.71230000000000004,20.468299999999999,0.10979999999999999,8.1570000000000004E-2,5.5710000000000003E-2,28.2,95.8,1870,2817,6.63]
["USA","Texas","Fort Worth Alliance Airport","Fort Worth Alliance Airport, Texas",1955,1485,1194.1351,0.7107,0.71230000000000004,20.468299999999999,0.10979999999999999,8.1570000000000004E-2,5.5710000000000003E-2,26.6,97.2,2376,2623,6.63]
["USA","Texas","Fort Worth Meacham Airport","Fort Worth Meacham Airport, Texas",2082,1367,1194.1351,0.7107,0.71230000000000004,20.468299999999999,0.10979999999999999,8.1570000000000004E-2,5.5710000000000003E-2,25.3,96.8,2261,2759,6.63]
["USA","Texas","Fort Worth NAS","Fort Worth NAS, Texas",2094,1373,1194.1351,0.7107,0.71230000000000004,20.468299999999999,0.10979999999999999,8.1570000000000004E-2,5.5710000000000003E-2,25.5,96.2,2259,2722,6.63]
["USA","Texas","Galveston / Scholes","Galveston / Scholes, Texas",3087,944,1194.1351,0.7107,0.71230000000000004,20.468299999999999,0.10979999999999999,8.1570000000000004E-2,5.5710000000000003E-2,37.200000000000003,89.9,1094,3203,6.63]
["USA","Texas","Georgetown","Georgetown, Texas",2185,1271,1194.1351,0.7107,0.71230000000000004,20.468299999999999,0.10979999999999999,8.1570000000000004E-2,5.5710000000000003E-2,28.4,94.7,1938,2704,6.63]
["USA","Texas","Harlingen","Harlingen, Texas",3184,552,1194.1351,0.7107,0.71230000000000004,20.468299999999999,0.10979999999999999,8.1570000000000004E-2,5.5710000000000003E-2,40.700000000000003,95.9,559,4099,6.63]
["USA","Texas","Houston Bush Intercontinental Airport","Houston Bush Intercontinental Airport, Texas",2545,1057,1194.1351,0.7107,0.71230000000000004,20.468299999999999,0.10979999999999999,8.1570000000000004E-2,5.5710000000000003E-2,32.9,93.3,1414,3001,6.63]
["USA","Texas","Houston William P Hobby Airport","Houston William P Hobby Airport, Texas",2768,986,1194.1351,0.7107,0.71230000000000004,20.468299999999999,0.10979999999999999,8.1570000000000004E-2,5.5710000000000003E-2,35.700000000000003,91.9,1204,3103,6.63]
["USA","Texas","Houston / D.W. Hooks","Houston / D.W. Hooks, Texas",2545,1080,1194.1351,0.7107,0.71230000000000004,20.468299999999999,0.10979999999999999,8.1570000000000004E-2,5.5710000000000003E-2,34,93,1395,2969,6.63]
["USA","Texas","Houston / Ellington","Houston / Ellington, Texas",2725,1010,1194.1351,0.7107,0.71230000000000004,20.468299999999999,0.10979999999999999,8.1570000000000004E-2,5.5710000000000003E-2,36.1,92.8,1216,3156,6.63]
["USA","Texas","Junction","Junction, Texas",1987,1285,1194.1351,0.7107,0.71230000000000004,20.468299999999999,0.10979999999999999,8.1570000000000004E-2,5.5710000000000003E-2,25.1,95.6,2137,2533,6.63]
["USA","Texas","Kelly AFB","Kelly AFB, Texas",2495,1025,1194.1351,0.7107,0.71230000000000004,20.468299999999999,0.10979999999999999,8.1570000000000004E-2,5.5710000000000003E-2,32.700000000000003,96.6,1380,3285,6.63]
["USA","Texas","Killeen","Killeen, Texas",2232,1268,1194.1351,0.7107,0.71230000000000004,20.468299999999999,0.10979999999999999,8.1570000000000004E-2,5.5710000000000003E-2,29.6,95.4,1870,2827,6.63]
["USA","Texas","Kingsville","Kingsville, Texas",3012,762,1194.1351,0.7107,0.71230000000000004,20.468299999999999,0.10979999999999999,8.1570000000000004E-2,5.5710000000000003E-2,36.700000000000003,94.8,898,3740,6.63]
["USA","Texas","Laredo","Laredo, Texas",2948,757,1194.1351,0.7107,0.71230000000000004,20.468299999999999,0.10979999999999999,8.1570000000000004E-2,5.5710000000000003E-2,37.700000000000003,99.5,861,4238,6.63]
["USA","Texas","Laughlin AFB","Laughlin AFB, Texas",2457,965,1194.1351,0.7107,0.71230000000000004,20.468299999999999,0.10979999999999999,8.1570000000000004E-2,5.5710000000000003E-2,33.6,99.4,1262,3522,6.63]
["USA","Texas","Longview","Longview, Texas",2109,1331,1194.1351,0.7107,0.71230000000000004,20.468299999999999,0.10979999999999999,8.1570000000000004E-2,5.5710000000000003E-2,27,93.4,2108,2496,6.63]
["USA","Texas","Lubbock","Lubbock, Texas",1519,1737,1194.1351,0.7107,0.71230000000000004,20.468299999999999,0.10979999999999999,8.1570000000000004E-2,5.5710000000000003E-2,18.8,93.9,3343,1829,6.63]
["USA","Texas","Lufkin","Lufkin, Texas",2188,1264,1194.1351,0.7107,0.71230000000000004,20.468299999999999,0.10979999999999999,8.1570000000000004E-2,5.5710000000000003E-2,29.2,93.3,1886,2580,6.63]
["USA","Texas","Mc Gregor","Mc Gregor, Texas",2024,1350,1194.1351,0.7107,0.71230000000000004,20.468299999999999,0.10979999999999999,8.1570000000000004E-2,5.5710000000000003E-2,28.1,96.9,2075,2690,6.63]
["USA","Texas","Mcallen","Mcallen, Texas",3300,571,1194.1351,0.7107,0.71230000000000004,20.468299999999999,0.10979999999999999,8.1570000000000004E-2,5.5710000000000003E-2,40.799999999999997,97.2,576,4428,6.63]
["USA","Texas","Mckinney","Mckinney, Texas",1897,1504,1194.1351,0.7107,0.71230000000000004,20.468299999999999,0.10979999999999999,8.1570000000000004E-2,5.5710000000000003E-2,26.6,97.1,2407,2537,6.63]
["USA","Texas","Midland","Midland, Texas",1755,1521,1194.1351,0.7107,0.71230000000000004,20.468299999999999,0.10979999999999999,8.1570000000000004E-2,5.5710000000000003E-2,23.1,95.9,2655,2260,6.63]
["USA","Texas","Nacogdoches","Nacogdoches, Texas",2049,1371,1194.1351,0.7107,0.71230000000000004,20.468299999999999,0.10979999999999999,8.1570000000000004E-2,5.5710000000000003E-2,27.9,92.8,2119,2374,6.63]
["USA","Texas","Palacios","Palacios, Texas",2998,927,1194.1351,0.7107,0.71230000000000004,20.468299999999999,0.10979999999999999,8.1570000000000004E-2,5.5710000000000003E-2,36,90.3,1120,3160,6.63]
["USA","Texas","Pine Springs","Pine Springs, Texas",1433,1835,1194.1351,0.7107,0.71230000000000004,20.468299999999999,0.10979999999999999,8.1570000000000004E-2,5.5710000000000003E-2,21.1,88.3,3356,1391,6.63]
["USA","Texas","Port Aransas","Port Aransas, Texas",3683,828,1194.1351,0.7107,0.71230000000000004,20.468299999999999,0.10979999999999999,8.1570000000000004E-2,5.5710000000000003E-2,40.9,84.7,831,3023,6.63]
["USA","Texas","Port Arthur","Port Arthur, Texas",2632,1057,1194.1351,0.7107,0.71230000000000004,20.468299999999999,0.10979999999999999,8.1570000000000004E-2,5.5710000000000003E-2,34.200000000000003,91.2,1357,2873,6.63]
["USA","Texas","Randolph AFB","Randolph AFB, Texas",2348,1109,1194.1351,0.7107,0.71230000000000004,20.468299999999999,0.10979999999999999,8.1570000000000004E-2,5.5710000000000003E-2,31.4,95.4,1553,2974,6.63]
["USA","Texas","Reese AFB","Reese AFB, Texas",1430,1698,1194.1351,0.7107,0.71230000000000004,20.468299999999999,0.10979999999999999,8.1570000000000004E-2,5.5710000000000003E-2,18,94.1,3325,1734,6.63]
["USA","Texas","Sabine","Sabine, Texas",2905,1187,1194.1351,0.7107,0.71230000000000004,20.468299999999999,0.10979999999999999,8.1570000000000004E-2,5.5710000000000003E-2,35.9,86.2,1439,2566,6.63]
["USA","Texas","San Angelo Mathis Field","San Angelo Mathis Field, Texas",1922,1374,1194.1351,0.7107,0.71230000000000004,20.468299999999999,0.10979999999999999,8.1570000000000004E-2,5.5710000000000003E-2,24.9,96,2296,2482,6.63]
["USA","Texas","San Antonio Int'l Airport","San Antonio Int'l Airport, Texas",2475,1063,1194.1351,0.7107,0.71230000000000004,20.468299999999999,0.10979999999999999,8.1570000000000004E-2,5.5710000000000003E-2,31.6,95.2,1480,3115,6.63]
["USA","Texas","San Marcos","San Marcos, Texas",2347,1135,1194.1351,0.7107,0.71230000000000004,20.468299999999999,0.10979999999999999,8.1570000000000004E-2,5.5710000000000003E-2,30.9,95.1,1613,2944,6.63]
["USA","Texas","Victoria","Victoria, Texas",2699,931,1194.1351,0.7107,0.71230000000000004,20.468299999999999,0.10979999999999999,8.1570000000000004E-2,5.5710000000000003E-2,34,93.3,1203,3182,6.63]
["USA","Texas","Waco","Waco, Texas",2143,1315,1194.1351,0.7107,0.71230000000000004,20.468299999999999,0.10979999999999999,8.1570000000000004E-2,5.5710000000000003E-2,27.5,96.9,2054,2849,6.63]
["USA","Texas","Wichita Falls",{"$f":"C770&\", \"&B770","v":"Wichita Falls, Texas"},1777,1583,1194.1351,0.7107,0.71230000000000004,20.468299999999999,0.10979999999999999,8.1570000000000004E-2,5.5710000000000003E-2,21.1,97.7,2896,2421,6.63]
["USA","Utah","Cedar City","Cedar City, Utah",707,2492,1361.2684999999999,1.3453999999999999,0.89759999999999995,20.620799999999999,9.9290000000000003E-2,8.0549999999999997E-2,5.62E-2,8.6999999999999993,88.8,5846,701,7]
["USA","Utah","Hill AFB / Ogden","Hill AFB / Ogden, Utah",942,2751,1361.2684999999999,1.3453999999999999,0.89759999999999995,20.620799999999999,9.9290000000000003E-2,8.0549999999999997E-2,5.62E-2,12.2,88.3,6053,915,7]
["USA","Utah","Logan","Logan, Utah",463,2660,1361.2684999999999,1.3453999999999999,0.89759999999999995,20.620799999999999,9.9290000000000003E-2,8.0549999999999997E-2,5.62E-2,0.2,89.9,7181,480,7]
["USA","Utah","Milford","Milford, Utah",711,2403,1361.2684999999999,1.3453999999999999,0.89759999999999995,20.620799999999999,9.9290000000000003E-2,8.0549999999999997E-2,5.62E-2,2.9,91.1,6219,773,7]
["USA","Utah","Price / Carbon","Price / Carbon, Utah",641,2809,1361.2684999999999,1.3453999999999999,0.89759999999999995,20.620799999999999,9.9290000000000003E-2,8.0549999999999997E-2,5.62E-2,8.4,87.5,6625,601,7]
["USA","Utah","Provo","Provo, Utah",747,2727,1361.2684999999999,1.3453999999999999,0.89759999999999995,20.620799999999999,9.9290000000000003E-2,8.0549999999999997E-2,5.62E-2,12.6,89.6,5953,766,7]
["USA","Utah","Saint George","Saint George, Utah",1837,1930,1361.2684999999999,1.3453999999999999,0.89759999999999995,20.620799999999999,9.9290000000000003E-2,8.0549999999999997E-2,5.62E-2,28.4,100.4,2943,2710,7]
["USA","Utah","Salt Lake City","Salt Lake City, Utah",1053,2603,1361.2684999999999,1.3453999999999999,0.89759999999999995,20.620799999999999,9.9290000000000003E-2,8.0549999999999997E-2,5.62E-2,14.1,92.2,5521,1193,7]
["USA","Utah","Vernal","Vernal, Utah",597,2759,1361.2684999999999,1.3453999999999999,0.89759999999999995,20.620799999999999,9.9290000000000003E-2,8.0549999999999997E-2,5.62E-2,5.3,88.3,6864,580,7]
["USA","Utah","Wendover Usaf Auxiliary Field","Wendover Usaf Auxiliary Field, Utah",1084,2639,1361.2684999999999,1.3453999999999999,0.89759999999999995,20.620799999999999,9.9290000000000003E-2,8.0549999999999997E-2,5.62E-2,12.2,90.9,5806,1170,7]
["USA","Vermont","Burlington","Burlington, Vermont",684,2595,84.957700000000003,1.1254,5.8299999999999998E-2,1157.4974999999999,0.17005999999999999,0.14316000000000001,9.98E-2,-3.5,82.4,7406,496,12.09]
["USA","Vermont","Montpelier","Montpelier, Vermont",422,2778,84.957700000000003,1.1254,5.8299999999999998E-2,1157.4974999999999,0.17005999999999999,0.14316000000000001,9.98E-2,-6,79.900000000000006,8217,262,12.09]
["USA","Vermont","Morrisville / Stowe Airport","Morrisville / Stowe Airport, Vermont",408,2685,84.957700000000003,1.1254,5.8299999999999998E-2,1157.4974999999999,0.17005999999999999,0.14316000000000001,9.98E-2,-8,81.099999999999994,8168,274,12.09]
["USA","Vermont","Rutland","Rutland, Vermont",495,2682,84.957700000000003,1.1254,5.8299999999999998E-2,1157.4974999999999,0.17005999999999999,0.14316000000000001,9.98E-2,-1.9,80.7,7475,324,12.09]
["USA","Vermont","Springfield / Hartness Airport","Springfield / Hartness Airport, Vermont",539,2743,84.957700000000003,1.1254,5.8299999999999998E-2,1157.4974999999999,0.17005999999999999,0.14316000000000001,9.98E-2,0.5,82,7372,382,12.09]
["USA","Virginia","Abington","Abington, Virginia",1183,2185,1523.1685,1.3696999999999999,4.9756999999999998,52.742100000000001,0.11078,8.0799999999999997E-2,6.7150000000000001E-2,17.7,84.2,4306,946,8.77]
["USA","Virginia","Blacksburg","Blacksburg, Virginia",946,2357,1523.1685,1.3696999999999999,4.9756999999999998,52.742100000000001,0.11078,8.0799999999999997E-2,6.7150000000000001E-2,15.7,83.7,4841,737,8.77]
["USA","Virginia","Chesapeake","Chesapeake, Virginia",1856,2109,1523.1685,1.3696999999999999,4.9756999999999998,52.742100000000001,0.11078,8.0799999999999997E-2,6.7150000000000001E-2,27.1,81,3330,1237,8.77]
["USA","Virginia","Danville FAA","Danville FAA, Virginia",1395,2007,1523.1685,1.3696999999999999,4.9756999999999998,52.742100000000001,0.11078,8.0799999999999997E-2,6.7150000000000001E-2,22.1,89.5,3588,1424,8.77]
["USA","Virginia","Dinwiddie","Dinwiddie, Virginia",1407,1965,1523.1685,1.3696999999999999,4.9756999999999998,52.742100000000001,0.11078,8.0799999999999997E-2,6.7150000000000001E-2,19.2,91.6,3750,1559,8.77]
["USA","Virginia","Fort Belvoir / Davison AAF","Fort Belvoir / Davison AAF, Virginia",1273,2197,1523.1685,1.3696999999999999,4.9756999999999998,52.742100000000001,0.11078,8.0799999999999997E-2,6.7150000000000001E-2,17.899999999999999,90.5,4312,1353,8.77]
["USA","Virginia","Hillsville","Hillsville, Virginia",979,2284,1523.1685,1.3696999999999999,4.9756999999999998,52.742100000000001,0.11078,8.0799999999999997E-2,6.7150000000000001E-2,15.9,81.400000000000006,4672,669,8.77]
["USA","Virginia","Hot Springs / Ingalls","Hot Springs / Ingalls, Virginia",806,2539,1523.1685,1.3696999999999999,4.9756999999999998,52.742100000000001,0.11078,8.0799999999999997E-2,6.7150000000000001E-2,6.9,78.7,6146,460,8.77]
["USA","Virginia","Langley AFB / Hampton","Langley AFB / Hampton, Virginia",1622,2038,1523.1685,1.3696999999999999,4.9756999999999998,52.742100000000001,0.11078,8.0799999999999997E-2,6.7150000000000001E-2,24.8,88.3,3413,1575,8.77]
["USA","Virginia","Leesburg / Godfrey","Leesburg / Godfrey, Virginia",1207,2294,1523.1685,1.3696999999999999,4.9756999999999998,52.742100000000001,0.11078,8.0799999999999997E-2,6.7150000000000001E-2,17.899999999999999,90.2,4501,1267,8.77]
["USA","Virginia","Lynchburg","Lynchburg, Virginia",1210,2182,1523.1685,1.3696999999999999,4.9756999999999998,52.742100000000001,0.11078,8.0799999999999997E-2,6.7150000000000001E-2,18.899999999999999,87.3,4191,1124,8.77]
["USA","Virginia","Manassas","Manassas, Virginia",1069,2370,1523.1685,1.3696999999999999,4.9756999999999998,52.742100000000001,0.11078,8.0799999999999997E-2,6.7150000000000001E-2,16.3,88.2,4809,1033,8.77]
["USA","Virginia","Marion / Wytheville","Marion / Wytheville, Virginia",1033,2212,1523.1685,1.3696999999999999,4.9756999999999998,52.742100000000001,0.11078,8.0799999999999997E-2,6.7150000000000001E-2,11.9,84.3,4893,831,8.77]
["USA","Virginia","Martinsville","Martinsville, Virginia",1199,2058,1523.1685,1.3696999999999999,4.9756999999999998,52.742100000000001,0.11078,8.0799999999999997E-2,6.7150000000000001E-2,18.399999999999999,90,3995,1249,8.77]
["USA","Virginia","Mecklenburg / Brunswick Airport","Mecklenburg / Brunswick Airport, Virginia",1449,1947,1523.1685,1.3696999999999999,4.9756999999999998,52.742100000000001,0.11078,8.0799999999999997E-2,6.7150000000000001E-2,23.2,90.3,3391,1527,8.77]
["USA","Virginia","Melfa / Accomack Airport","Melfa / Accomack Airport, Virginia",1422,2126,1523.1685,1.3696999999999999,4.9756999999999998,52.742100000000001,0.11078,8.0799999999999997E-2,6.7150000000000001E-2,23.2,89.8,3702,1469,8.77]
["USA","Virginia","Newport News","Newport News, Virginia",1501,2019,1523.1685,1.3696999999999999,4.9756999999999998,52.742100000000001,0.11078,8.0799999999999997E-2,6.7150000000000001E-2,22.7,89.8,3559,1551,8.77]
["USA","Virginia","Norfolk International Airport","Norfolk International Airport, Virginia",1664,1976,1523.1685,1.3696999999999999,4.9756999999999998,52.742100000000001,0.11078,8.0799999999999997E-2,6.7150000000000001E-2,25.6,88.9,3244,1657,8.77]
["USA","Virginia","Norfolk NAS","Norfolk NAS, Virginia",1729,1955,1523.1685,1.3696999999999999,4.9756999999999998,52.742100000000001,0.11078,8.0799999999999997E-2,6.7150000000000001E-2,26.8,89.4,3111,1758,8.77]
["USA","Virginia","Oceana NAS","Oceana NAS, Virginia",1607,1996,1523.1685,1.3696999999999999,4.9756999999999998,52.742100000000001,0.11078,8.0799999999999997E-2,6.7150000000000001E-2,25.3,88.2,3301,1553,8.77]
["USA","Virginia","Quantico MCAS","Quantico MCAS, Virginia",1422,2192,1523.1685,1.3696999999999999,4.9756999999999998,52.742100000000001,0.11078,8.0799999999999997E-2,6.7150000000000001E-2,19.7,88.1,4138,1369,8.77]
["USA","Virginia","Roanoke","Roanoke, Virginia",1269,2138,1523.1685,1.3696999999999999,4.9756999999999998,52.742100000000001,0.11078,8.0799999999999997E-2,6.7150000000000001E-2,19,87.4,4098,1184,8.77]
["USA","Virginia","Shannon","Shannon, Virginia",1291,2129,1523.1685,1.3696999999999999,4.9756999999999998,52.742100000000001,0.11078,8.0799999999999997E-2,6.7150000000000001E-2,18.3,90.4,4143,1366,8.77]
["USA","Virginia","Staunton / Shenandoah","Staunton / Shenandoah, Virginia",1140,2185,1523.1685,1.3696999999999999,4.9756999999999998,52.742100000000001,0.11078,8.0799999999999997E-2,6.7150000000000001E-2,16.8,89.6,4389,1168,8.77]
["USA","Virginia","Wallops Island","Wallops Island, Virginia",1446,2261,1523.1685,1.3696999999999999,4.9756999999999998,52.742100000000001,0.11078,8.0799999999999997E-2,6.7150000000000001E-2,22.2,85.4,4032,1229,8.77]
["USA","Virginia","Washington DC Dulles Int'l Airport","Washington DC Dulles Int'l Airport, Virginia",1158,2305,1523.1685,1.3696999999999999,4.9756999999999998,52.742100000000001,0.11078,8.0799999999999997E-2,6.7150000000000001E-2,15.7,88.2,4735,1119,8.77]
["USA","Virginia","Washington DC Reagan Airport","Washington DC Reagan Airport, Virginia",1511,2148,1523.1685,1.3696999999999999,4.9756999999999998,52.742100000000001,0.11078,8.0799999999999997E-2,6.7150000000000001E-2,20.3,89.2,4001,1524,8.77]
["USA","Virginia","Winchester","Winchester, Virginia",1183,2306,1523.1685,1.3696999999999999,4.9756999999999998,52.742100000000001,0.11078,8.0799999999999997E-2,6.7150000000000001E-2,18.2,88.5,4497,1158,8.77]
["USA","Virginia","Wise / Lonesome Pine","Wise / Lonesome Pine, Virginia",999,2182,1523.1685,1.3696999999999999,4.9756999999999998,52.742100000000001,0.11078,8.0799999999999997E-2,6.7150000000000001E-2,11.9,81.599999999999994,4827,691,8.77]
["USA","Washington","Arlington","Arlington, Washington",138,3171,1374.0059000000001,1.1896,0.45129999999999998,46.427300000000002,8.5279999999999995E-2,7.6759999999999995E-2,4.1300000000000003E-2,24.7,75.400000000000006,5324,60,9.82]
["USA","Washington","Bellingham","Bellingham, Washington",153,3069,1374.0059000000001,1.1896,0.45129999999999998,46.427300000000002,8.5279999999999995E-2,7.6759999999999995E-2,4.1300000000000003E-2,23,73,5370,51,9.82]
["USA","Washington","Bremerton","Bremerton, Washington",175,3475,1374.0059000000001,1.1896,0.45129999999999998,46.427300000000002,8.5279999999999995E-2,7.6759999999999995E-2,4.1300000000000003E-2,27,78.7,5502,100,9.82]
["USA","Washington","Fairchild AFB","Fairchild AFB, Washington",470,2983,1374.0059000000001,1.1896,0.45129999999999998,46.427300000000002,8.5279999999999995E-2,7.6759999999999995E-2,4.1300000000000003E-2,10.6,85.2,6762,396,9.82]
["USA","Washington","Friday Harbor","Friday Harbor, Washington",62,3821,1374.0059000000001,1.1896,0.45129999999999998,46.427300000000002,8.5279999999999995E-2,7.6759999999999995E-2,4.1300000000000003E-2,30.2,72,5541,18,9.82]
["USA","Washington","Gray AAF","Gray AAF, Washington",213,3069,1374.0059000000001,1.1896,0.45129999999999998,46.427300000000002,8.5279999999999995E-2,7.6759999999999995E-2,4.1300000000000003E-2,24.4,79.099999999999994,5192,125,9.82]
["USA","Washington","Hanford","Hanford, Washington",945,2284,1374.0059000000001,1.1896,0.45129999999999998,46.427300000000002,8.5279999999999995E-2,7.6759999999999995E-2,4.1300000000000003E-2,12.6,93.3,4987,1114,9.82]
["USA","Washington","Hoquiam","Hoquiam, Washington",142,3548,1374.0059000000001,1.1896,0.45129999999999998,46.427300000000002,8.5279999999999995E-2,7.6759999999999995E-2,4.1300000000000003E-2,30.9,69.400000000000006,5041,26,9.82]
["USA","Washington","Kelso","Kelso, Washington",308,2956,1374.0059000000001,1.1896,0.45129999999999998,46.427300000000002,8.5279999999999995E-2,7.6759999999999995E-2,4.1300000000000003E-2,26.4,79.5,4755,186,9.82]
["USA","Washington","Mcchord AFB / Tacoma","Mcchord AFB / Tacoma, Washington",213,3050,1374.0059000000001,1.1896,0.45129999999999998,46.427300000000002,8.5279999999999995E-2,7.6759999999999995E-2,4.1300000000000003E-2,24.8,79,5109,124,9.82]
["USA","Washington","Olympia","Olympia, Washington",164,3152,1374.0059000000001,1.1896,0.45129999999999998,46.427300000000002,8.5279999999999995E-2,7.6759999999999995E-2,4.1300000000000003E-2,24.1,79.8,5372,101,9.82]
["USA","Washington","Omak","Omak, Washington",623,2922,1374.0059000000001,1.1896,0.45129999999999998,46.427300000000002,8.5279999999999995E-2,7.6759999999999995E-2,4.1300000000000003E-2,13.9,90.6,6222,664,9.82]
["USA","Washington","Pasco","Pasco, Washington",712,2334,1374.0059000000001,1.1896,0.45129999999999998,46.427300000000002,8.5279999999999995E-2,7.6759999999999995E-2,4.1300000000000003E-2,14.5,92.6,4911,819,9.82]
["USA","Washington","Pearson Fld","Pearson Fld, Washington",509,2848,1374.0059000000001,1.1896,0.45129999999999998,46.427300000000002,8.5279999999999995E-2,7.6759999999999995E-2,4.1300000000000003E-2,27.9,82.4,4403,369,9.82]
["USA","Washington","Pullman / Moscow","Pullman / Moscow, Washington",309,3116,1374.0059000000001,1.1896,0.45129999999999998,46.427300000000002,8.5279999999999995E-2,7.6759999999999995E-2,4.1300000000000003E-2,15.8,85.6,6388,265,9.82]
["USA","Washington","Quillayute State Airport","Quillayute State Airport, Washington",89,3587,1374.0059000000001,1.1896,0.45129999999999998,46.427300000000002,8.5279999999999995E-2,7.6759999999999995E-2,4.1300000000000003E-2,27.1,70.400000000000006,5665,20,9.82]
["USA","Washington","Seattle Boeing Field","Seattle Boeing Field, Washington",465,2776,1374.0059000000001,1.1896,0.45129999999999998,46.427300000000002,8.5279999999999995E-2,7.6759999999999995E-2,4.1300000000000003E-2,28,79.400000000000006,4280,279,9.82]
["USA","Washington","Seattle Seattle-Tacoma Int'l Airport","Seattle Seattle-Tacoma Int'l Airport, Washington",327,3161,1374.0059000000001,1.1896,0.45129999999999998,46.427300000000002,8.5279999999999995E-2,7.6759999999999995E-2,4.1300000000000003E-2,29.1,78,4729,177,9.82]
["USA","Washington","Shelton / Sanderson","Shelton / Sanderson, Washington",181,3371,1374.0059000000001,1.1896,0.45129999999999998,46.427300000000002,8.5279999999999995E-2,7.6759999999999995E-2,4.1300000000000003E-2,27,79.3,5337,108,9.82]
["USA","Washington","Smith Island",{"$f":"C834&\", \"&B834","v":"Smith Island, Washington"},0,4052,1374.0059000000001,1.1896,0.45129999999999998,46.427300000000002,8.5279999999999995E-2,7.6759999999999995E-2,4.1300000000000003E-2,32.1,61.6,5555,1,9.82]
["USA","Washington","Snohomish County","Snohomish County, Washington",209,3542,1374.0059000000001,1.1896,0.45129999999999998,46.427300000000002,8.5279999999999995E-2,7.6759999999999995E-2,4.1300000000000003E-2,30.1,72.8,5151,68,9.82]
["USA","Washington","Spokane / Felts Field","Spokane / Felts Field, Washington",464,2820,1374.0059000000001,1.1896,0.45129999999999998,46.427300000000002,8.5279999999999995E-2,7.6759999999999995E-2,4.1300000000000003E-2,12.9,88.1,6121,447,9.82]
["USA","Washington","Spokane International Airport","Spokane International Airport, Washington",486,2897,1374.0059000000001,1.1896,0.45129999999999998,46.427300000000002,8.5279999999999995E-2,7.6759999999999995E-2,4.1300000000000003E-2,9.6,85.9,6687,423,9.82]
["USA","Washington","Stampede Pass","Stampede Pass, Washington",218,4007,1374.0059000000001,1.1896,0.45129999999999998,46.427300000000002,8.5279999999999995E-2,7.6759999999999995E-2,4.1300000000000003E-2,11.1,71.599999999999994,8998,60,9.82]
["USA","Washington","Tacoma Narrows","Tacoma Narrows, Washington",308,3430,1374.0059000000001,1.1896,0.45129999999999998,46.427300000000002,8.5279999999999995E-2,7.6759999999999995E-2,4.1300000000000003E-2,32.6,77,4631,154,9.82]
["USA","Washington","Walla Walla","Walla Walla, Washington",839,2393,1374.0059000000001,1.1896,0.45129999999999998,46.427300000000002,8.5279999999999995E-2,7.6759999999999995E-2,4.1300000000000003E-2,16.2,91.1,4866,912,9.82]
["USA","Washington","Wenatchee / Pangborn","Wenatchee / Pangborn, Washington",771,2654,1374.0059000000001,1.1896,0.45129999999999998,46.427300000000002,8.5279999999999995E-2,7.6759999999999995E-2,4.1300000000000003E-2,12.1,88.4,5849,752,9.82]
["USA","Washington","West Point","West Point, Washington",180,3686,1374.0059000000001,1.1896,0.45129999999999998,46.427300000000002,8.5279999999999995E-2,7.6759999999999995E-2,4.1300000000000003E-2,33.200000000000003,66.2,4884,9,9.82]
["USA","Washington","Whidbey Island","Whidbey Island, Washington",114,3400,1374.0059000000001,1.1896,0.45129999999999998,46.427300000000002,8.5279999999999995E-2,7.6759999999999995E-2,4.1300000000000003E-2,26.9,66.900000000000006,5397,9,9.82]
["USA","Washington","Yakima","Yakima, Washington",488,2698,1374.0059000000001,1.1896,0.45129999999999998,46.427300000000002,8.5279999999999995E-2,7.6759999999999995E-2,4.1300000000000003E-2,12.1,89,5946,488,9.82]
["USA","West Virginia","Beckley","Beckley, West Virginia",849,2359,2093.6206999999999,1.4998,8.3191000000000006,23.497800000000002,9.8500000000000004E-2,8.4209999999999993E-2,6.3289999999999999E-2,11.4,80.5,5269,548,9.39]
["USA","West Virginia","Bluefield / Mercer","Bluefield / Mercer, West Virginia",988,2245,2093.6206999999999,1.4998,8.3191000000000006,23.497800000000002,9.8500000000000004E-2,8.4209999999999993E-2,6.3289999999999999E-2,12,80.400000000000006,4958,634,9.39]
["USA","West Virginia","Bridgeport","Bridgeport, West Virginia",1012,2305,2093.6206999999999,1.4998,8.3191000000000006,23.497800000000002,9.8500000000000004E-2,8.4209999999999993E-2,6.3289999999999999E-2,13.7,84,4926,801,9.39]
["USA","West Virginia","Charleston","Charleston, West Virginia",1190,2120,2093.6206999999999,1.4998,8.3191000000000006,23.497800000000002,9.8500000000000004E-2,8.4209999999999993E-2,6.3289999999999999E-2,14.7,86.5,4443,1066,9.39]
["USA","West Virginia","Elkins","Elkins, West Virginia",637,2407,2093.6206999999999,1.4998,8.3191000000000006,23.497800000000002,9.8500000000000004E-2,8.4209999999999993E-2,6.3289999999999999E-2,6.7,82,5847,451,9.39]
["USA","West Virginia","Huntington","Huntington, West Virginia",1243,2109,2093.6206999999999,1.4998,8.3191000000000006,23.497800000000002,9.8500000000000004E-2,8.4209999999999993E-2,6.3289999999999999E-2,14.6,87,4429,1139,9.39]
["USA","West Virginia","Martinsburg","Martinsburg, West Virginia",1060,2361,2093.6206999999999,1.4998,8.3191000000000006,23.497800000000002,9.8500000000000004E-2,8.4209999999999993E-2,6.3289999999999999E-2,14.6,87.9,4959,1011,9.39]
["USA","West Virginia","Morgantown","Morgantown, West Virginia",1007,2293,2093.6206999999999,1.4998,8.3191000000000006,23.497800000000002,9.8500000000000004E-2,8.4209999999999993E-2,6.3289999999999999E-2,11.6,84.4,5102,814,9.39]
["USA","West Virginia","Parkersburg","Parkersburg, West Virginia",1107,2213,2093.6206999999999,1.4998,8.3191000000000006,23.497800000000002,9.8500000000000004E-2,8.4209999999999993E-2,6.3289999999999999E-2,11.8,85.9,4906,964,9.39]
["USA","Wisconsin","Antigo / Lang","Antigo / Lang, Wisconsin",431,2772,1810.9429,1.6052999999999999,4.4635999999999996,35.352400000000003,0.13191,0.10511,7.3450000000000001E-2,-8,80.599999999999994,8430,280,7.34]
["USA","Wisconsin","Appleton / Outagamie","Appleton / Outagamie, Wisconsin",837,2648,1810.9429,1.6052999999999999,4.4635999999999996,35.352400000000003,0.13191,0.10511,7.3450000000000001E-2,-0.1,82.3,7184,603,7.34]
["USA","Wisconsin","Devils Island","Devils Island, Wisconsin",462,3179,1810.9429,1.6052999999999999,4.4635999999999996,35.352400000000003,0.13191,0.10511,7.3450000000000001E-2,-0.7,73,8702,154,7.34]
["USA","Wisconsin","Eagle River Union","Eagle River Union, Wisconsin",381,2910,1810.9429,1.6052999999999999,4.4635999999999996,35.352400000000003,0.13191,0.10511,7.3450000000000001E-2,-8.6999999999999993,79.5,8935,230,7.34]
["USA","Wisconsin","Eau Claire","Eau Claire, Wisconsin",765,2528,1810.9429,1.6052999999999999,4.4635999999999996,35.352400000000003,0.13191,0.10511,7.3450000000000001E-2,-9.6,84.3,7859,615,7.34]
["USA","Wisconsin","Fond Du Lac","Fond Du Lac, Wisconsin",820,2598,1810.9429,1.6052999999999999,4.4635999999999996,35.352400000000003,0.13191,0.10511,7.3450000000000001E-2,0.4,82.3,6992,591,7.34]
["USA","Wisconsin","Green Bay","Green Bay, Wisconsin",648,2661,1810.9429,1.6052999999999999,4.4635999999999996,35.352400000000003,0.13191,0.10511,7.3450000000000001E-2,-4.3,82.4,7684,470,7.34]
["USA","Wisconsin","Hayward","Hayward, Wisconsin",477,2777,1810.9429,1.6052999999999999,4.4635999999999996,35.352400000000003,0.13191,0.10511,7.3450000000000001E-2,-9.4,81.900000000000006,8610,336,7.34]
["USA","Wisconsin","Juneau","Juneau, Wisconsin",810,2584,1810.9429,1.6052999999999999,4.4635999999999996,35.352400000000003,0.13191,0.10511,7.3450000000000001E-2,1.1000000000000001,82.1,6879,577,7.34]
["USA","Wisconsin","Kenosha","Kenosha, Wisconsin",800,2626,1810.9429,1.6052999999999999,4.4635999999999996,35.352400000000003,0.13191,0.10511,7.3450000000000001E-2,5.0999999999999996,83.9,6554,630,7.34]
["USA","Wisconsin","La Crosse","La Crosse, Wisconsin",934,2399,1810.9429,1.6052999999999999,4.4635999999999996,35.352400000000003,0.13191,0.10511,7.3450000000000001E-2,-5.8,85.9,7076,813,7.34]
["USA","Wisconsin","Madison","Madison, Wisconsin",768,2544,1810.9429,1.6052999999999999,4.4635999999999996,35.352400000000003,0.13191,0.10511,7.3450000000000001E-2,-2.9,84,7197,608,7.34]
["USA","Wisconsin","Manitowac","Manitowac, Wisconsin",567,2805,1810.9429,1.6052999999999999,4.4635999999999996,35.352400000000003,0.13191,0.10511,7.3450000000000001E-2,0.5,79.3,7538,338,7.34]
["USA","Wisconsin","Marshfield","Marshfield, Wisconsin",635,2619,1810.9429,1.6052999999999999,4.4635999999999996,35.352400000000003,0.13191,0.10511,7.3450000000000001E-2,-7.7,81.599999999999994,7932,439,7.34]
["USA","Wisconsin","Milwaukee","Milwaukee, Wisconsin",883,2572,1810.9429,1.6052999999999999,4.4635999999999996,35.352400000000003,0.13191,0.10511,7.3450000000000001E-2,1.8,83.6,6774,684,7.34]
["USA","Wisconsin","Mosinee / Central","Mosinee / Central, Wisconsin",547,2765,1810.9429,1.6052999999999999,4.4635999999999996,35.352400000000003,0.13191,0.10511,7.3450000000000001E-2,-6.4,81.400000000000006,8227,374,7.34]
["USA","Wisconsin","Park Falls","Park Falls, Wisconsin",491,2808,1810.9429,1.6052999999999999,4.4635999999999996,35.352400000000003,0.13191,0.10511,7.3450000000000001E-2,-11.9,78.7,8998,280,7.34]
["USA","Wisconsin","Phillips","Phillips, Wisconsin",469,2732,1810.9429,1.6052999999999999,4.4635999999999996,35.352400000000003,0.13191,0.10511,7.3450000000000001E-2,-12.6,80.599999999999994,8834,305,7.34]
["USA","Wisconsin","Rhinelander","Rhinelander, Wisconsin",444,2834,1810.9429,1.6052999999999999,4.4635999999999996,35.352400000000003,0.13191,0.10511,7.3450000000000001E-2,-8.3000000000000007,81.099999999999994,8654,298,7.34]
["USA","Wisconsin","Rice Lake","Rice Lake, Wisconsin",631,2620,1810.9429,1.6052999999999999,4.4635999999999996,35.352400000000003,0.13191,0.10511,7.3450000000000001E-2,-7.6,82,7925,447,7.34]
["USA","Wisconsin","Sheboygan","Sheboygan, Wisconsin",636,2745,1810.9429,1.6052999999999999,4.4635999999999996,35.352400000000003,0.13191,0.10511,7.3450000000000001E-2,1.1000000000000001,81.3,7309,432,7.34]
["USA","Wisconsin","Sturgeon Bay","Sturgeon Bay, Wisconsin",606,2840,1810.9429,1.6052999999999999,4.4635999999999996,35.352400000000003,0.13191,0.10511,7.3450000000000001E-2,-0.1,79.099999999999994,7704,356,7.34]
["USA","Wisconsin","Watertown","Watertown, Wisconsin",793,2571,1810.9429,1.6052999999999999,4.4635999999999996,35.352400000000003,0.13191,0.10511,7.3450000000000001E-2,0.6,83.8,6900,621,7.34]
["USA","Wisconsin","Wausau","Wausau, Wisconsin",666,2638,1810.9429,1.6052999999999999,4.4635999999999996,35.352400000000003,0.13191,0.10511,7.3450000000000001E-2,-7.9,82,8013,472,7.34]
["USA","Wisconsin","Wisconsin Rapids","Wisconsin Rapids, Wisconsin",691,2664,1810.9429,1.6052999999999999,4.4635999999999996,35.352400000000003,0.13191,0.10511,7.3450000000000001E-2,-2.2999999999999998,82.2,7469,495,7.34]
["USA","Wisconsin","Wittman","Wittman, Wisconsin",772,2672,1810.9429,1.6052999999999999,4.4635999999999996,35.352400000000003,0.13191,0.10511,7.3450000000000001E-2,-0.2,82.1,7258,550,7.34]
["USA","Wyoming","Big Piney","Big Piney, Wyoming",52,3256,2221.1743999999999,3.2902,3.9030999999999998,25.080300000000001,9.8470000000000002E-2,8.2400000000000001E-2,6.0269999999999997E-2,-12.6,79.3,10527,31,6.72]
["USA","Wyoming","Casper","Casper, Wyoming",485,2627,2221.1743999999999,3.2902,3.9030999999999998,25.080300000000001,9.8470000000000002E-2,8.2400000000000001E-2,6.0269999999999997E-2,-2.1,88.2,7346,469,6.72]
["USA","Wyoming","Cheyenne","Cheyenne, Wyoming",420,2710,2221.1743999999999,3.2902,3.9030999999999998,25.080300000000001,9.8470000000000002E-2,8.2400000000000001E-2,6.0269999999999997E-2,1.7,83.5,7148,324,6.72]
["USA","Wyoming","Cody","Cody, Wyoming",508,2551,2221.1743999999999,3.2902,3.9030999999999998,25.080300000000001,9.8470000000000002E-2,8.2400000000000001E-2,6.0269999999999997E-2,-5.4,84.1,7484,404,6.72]
["USA","Wyoming","Gillette","Gillette, Wyoming",555,2571,2221.1743999999999,3.2902,3.9030999999999998,25.080300000000001,9.8470000000000002E-2,8.2400000000000001E-2,6.0269999999999997E-2,-4.4000000000000004,88.5,7434,543,6.72]
["USA","Wyoming","Jackson Hole","Jackson Hole, Wyoming",37,3312,2221.1743999999999,3.2902,3.9030999999999998,25.080300000000001,9.8470000000000002E-2,8.2400000000000001E-2,6.0269999999999997E-2,-9,78.8,10212,21,6.72]
["USA","Wyoming","Lander","Lander, Wyoming",602,2673,2221.1743999999999,3.2902,3.9030999999999998,25.080300000000001,9.8470000000000002E-2,8.2400000000000001E-2,6.0269999999999997E-2,-2.9,86.3,7562,534,6.72]
["USA","Wyoming","Laramie","Laramie, Wyoming",115,3096,2221.1743999999999,3.2902,3.9030999999999998,25.080300000000001,9.8470000000000002E-2,8.2400000000000001E-2,6.0269999999999997E-2,-2.2000000000000002,79.599999999999994,8668,70,6.72]
["USA","Wyoming","Rock Springs","Rock Springs, Wyoming",380,3029,2221.1743999999999,3.2902,3.9030999999999998,25.080300000000001,9.8470000000000002E-2,8.2400000000000001E-2,6.0269999999999997E-2,0.4,82.2,8152,272,6.72]
["USA","Wyoming","Sheridan","Sheridan, Wyoming",486,2511,2221.1743999999999,3.2902,3.9030999999999998,25.080300000000001,9.8470000000000002E-2,8.2400000000000001E-2,6.0269999999999997E-2,-6.1,88.5,7438,476,6.72]
["USA","Wyoming","Worland","Worland, Wyoming",656,2421,2221.1743999999999,3.2902,3.9030999999999998,25.080300000000001,9.8470000000000002E-2,8.2400000000000001E-2,6.0269999999999997E-2,-9.5,90,7516,683,6.72]
["USA","Wyoming","Yellowstone Lake","Yellowstone Lake, Wyoming",0,3594,2221.1743999999999,3.2902,3.9030999999999998,25.080300000000001,9.8470000000000002E-2,8.2400000000000001E-2,6.0269999999999997E-2,-13.4,70.5,11742,0,6.72]
["Canada","Alberta","Calgary Int'l Airport","Calgary Int'l Airport, Alberta",139,2774,0,0,0,0,0,0,0,-14.2,76.599999999999994,9154,67,0]
["Canada","Alberta","Cop Upper","Cop Upper, Alberta",176,2812,0,0,0,0,0,0,0,-12.4,75.2,9070,75,0]
["Canada","Alberta","Edmonton City Centre Airport","Edmonton City Centre Airport, Alberta",244,2800,0,0,0,0,0,0,0,-16.399999999999999,76.2,9495,114,0]
["Canada","Alberta","Edmonton Int'l Airport","Edmonton Int'l Airport, Alberta",96,2894,0,0,0,0,0,0,0,-20.9,75.3,10359,41,0]
["Canada","Alberta","Edmonton Namao Airport","Edmonton Namao Airport, Alberta",153,2859,0,0,0,0,0,0,0,-18,74.900000000000006,9889,63,0]
["Canada","Alberta","Fort Mcmurray Airport","Fort Mcmurray Airport, Alberta",170,2925,0,0,0,0,0,0,0,-29.3,77,11492,85,0]
["Canada","Alberta","Grande Prairie Airport",{"$f":"C898&\", \"&B898","v":"Grande Prairie Airport, Alberta"},108,2807,0,0,0,0,0,0,0,-25.6,74.8,10595,44,0]
["Canada","Alberta","Lacombe","Lacombe, Alberta",83,2915,0,0,0,0,0,0,0,-20,76,10323,38,0]
["Canada","Alberta","Lethbridge Airport","Lethbridge Airport, Alberta",243,2498,0,0,0,0,0,0,0,-15.5,81.2,8380,164,0]
["Canada","Alberta","Lethbridge","Lethbridge, Alberta",296,2494,0,0,0,0,0,0,0,-13.1,82,8115,210,0]
["Canada","Alberta","Medicine Hat Airport","Medicine Hat Airport, Alberta",391,2445,0,0,0,0,0,0,0,-17.899999999999999,83.6,8447,303,0]
["Canada","Alberta","Red Deer Airport","Red Deer Airport, Alberta",90,2905,0,0,0,0,0,0,0,-20,75.7,10289,40,0]
["Canada","Alberta","Springbank Airport","Springbank Airport, Alberta",22,2966,0,0,0,0,0,0,0,-18.3,73.599999999999994,10293,8,0]
["Canada","British Columbia","Abbotsford Airport","Abbotsford Airport, British Columbia",220,2963,0,0,0,0,0,0,0,21.8,78.2,5333,121,0]
["Canada","British Columbia","Agassiz","Agassiz, British Columbia",325,2932,0,0,0,0,0,0,0,23.4,79.7,5082,199,0]
["Canada","British Columbia","BalleNAS Island","BalleNAS Island, British Columbia",500,3433,0,0,0,0,0,0,0,33.6,70.900000000000006,4492,123,0]
["Canada","British Columbia","Comox Airport","Comox Airport, British Columbia",254,3457,0,0,0,0,0,0,0,26.3,73.3,5574,88,0]
["Canada","British Columbia","Discovery Island","Discovery Island, British Columbia",273,3900,0,0,0,0,0,0,0,36.9,67.2,4566,25,0]
["Canada","British Columbia","Entrance Island","Entrance Island, British Columbia",533,3543,0,0,0,0,0,0,0,32.799999999999997,70,4753,111,0]
["Canada","British Columbia","Esquimalt Harbour","Esquimalt Harbour, British Columbia",189,3755,0,0,0,0,0,0,0,31.8,66.900000000000006,5194,15,0]
["Canada","British Columbia","Howe Sound - Pam Rocks","Howe Sound - Pam Rocks, British Columbia",555,3331,0,0,0,0,0,0,0,31.6,71.7,4636,155,0]
["Canada","British Columbia","Kamloops Airport","Kamloops Airport, British Columbia",553,2478,0,0,0,0,0,0,0,2.8,85,6421,461,0]
["Canada","British Columbia","Kelowna Airport","Kelowna Airport, British Columbia",289,2884,0,0,0,0,0,0,0,6.2,83.6,7067,224,0]
["Canada","British Columbia","Malahat","Malahat, British Columbia",407,3614,0,0,0,0,0,0,0,26.6,75.2,5783,173,0]
["Canada","British Columbia","Penticton Airport","Penticton Airport, British Columbia",471,2793,0,0,0,0,0,0,0,11.3,83.8,6250,369,0]
["Canada","British Columbia","Pitt Meadows","Pitt Meadows, British Columbia",227,3053,0,0,0,0,0,0,0,23.5,79.900000000000006,5280,141,0]
["Canada","British Columbia","Point Atkinson","Point Atkinson, British Columbia",757,3072,0,0,0,0,0,0,0,35,72.8,3840,246,0]
["Canada","British Columbia","Prince George Airport","Prince George Airport, British Columbia",85,2773,0,0,0,0,0,0,0,-15.1,74.599999999999994,9255,34,0]
["Canada","British Columbia","Sandheads","Sandheads, British Columbia",400,3361,0,0,0,0,0,0,0,30.8,68.599999999999994,4790,60,0]
["Canada","British Columbia","Summerland","Summerland, British Columbia",564,2918,0,0,0,0,0,0,0,13.4,84.5,6274,458,0]
["Canada","British Columbia","Vancouver Harbour","Vancouver Harbour, British Columbia",354,3341,0,0,0,0,0,0,0,31.1,73.400000000000006,4719,124,0]
["Canada","British Columbia","Vancouver Int'l Airport","Vancouver Int'l Airport, British Columbia",250,3159,0,0,0,0,0,0,0,24.9,72,5278,73,0]
["Canada","British Columbia","Vernon","Vernon, British Columbia",474,3000,0,0,0,0,0,0,0,11.4,83.7,6699,369,0]
["Canada","British Columbia","Victoria Gonzales","Victoria Gonzales, British Columbia",234,3636,0,0,0,0,0,0,0,31.7,69.099999999999994,5045,40,0]
["Canada","British Columbia","Victoria Hartland","Victoria Hartland, British Columbia",367,3359,0,0,0,0,0,0,0,30.6,77.099999999999994,4815,185,0]
["Canada","British Columbia","Victoria Int'l Airport","Victoria Int'l Airport, British Columbia",119,3472,0,0,0,0,0,0,0,27.4,73.099999999999994,5439,40,0]
["Canada","British Columbia","Victoria Marine","Victoria Marine, British Columbia",0,3900,0,0,0,0,0,0,0,27.4,64.099999999999994,6110,1,0]
["Canada","British Columbia","Victoria University","Victoria University, British Columbia",181,3509,0,0,0,0,0,0,0,32.200000000000003,74.3,4796,70,0]
["Canada","British Columbia","West Vancouver","West Vancouver, British Columbia",311,3334,0,0,0,0,0,0,0,26.7,74.8,5320,127,0]
["Canada","British Columbia","White Rock Campbell","White Rock Campbell, British Columbia",183,3158,0,0,0,0,0,0,0,27.1,71.7,4987,51,0]
["Canada","Manitoba","Winnipeg Richardson Int'l Airport","Winnipeg Richardson Int'l Airport, Manitoba",455,2862,0,0,0,0,0,0,0,-21.8,81,10350,303,0]
["Canada","New Brunswick","Fredericton Airport","Fredericton Airport, New Brunswick",402,2863,0,0,0,0,0,0,0,-5.8,79.2,8445,238,0]
["Canada","New Brunswick","Moncton Airport","Moncton Airport, New Brunswick",334,2979,0,0,0,0,0,0,0,-4.5,77.3,8626,171,0]
["Canada","New Brunswick","Saint John Airport","Saint John Airport, New Brunswick",159,2996,0,0,0,0,0,0,0,-3.8,73,8588,53,0]
["Canada","Newfoundland","St John'S Airport","St John'S Airport, Newfoundland",211,3693,0,0,0,0,0,0,0,7.6,70.8,8832,51,0]
["Canada","Northwest Territories","Yellowknife Airport","Yellowknife Airport, Northwest Territories",225,3487,0,0,0,0,0,0,0,-37.9,71.3,14951,59,0]
["Canada","Nova Scotia","Halifax Stanfield Int'l Airport","Halifax Stanfield Int'l Airport, Nova Scotia",393,3006,0,0,0,0,0,0,0,2.4,75.8,7840,177,0]
["Canada","Nova Scotia","Shearwater Airport","Shearwater Airport, Nova Scotia",348,3061,0,0,0,0,0,0,0,5.2,73,7626,116,0]
["Canada","Nova Scotia","Shearwater Jetty","Shearwater Jetty, Nova Scotia",376,3124,0,0,0,0,0,0,0,11.3,73.3,6990,130,0]
["Canada","Nova Scotia","Sydney Airport","Sydney Airport, Nova Scotia",324,3266,0,0,0,0,0,0,0,3.8,75,8329,135,0]
["Canada","Nunavut","Iqaluit Airport","Iqaluit Airport, Nunavut",0,4263,0,0,0,0,0,0,0,-37.1,53.6,18136,0,0]
["Canada","Ontario","Beausoleil","Beausoleil, Ontario",619,2699,0,0,0,0,0,0,0,-4.8,79.7,7851,379,0]
["Canada","Ontario","Belle River","Belle River, Ontario",1062,2616,0,0,0,0,0,0,0,10.1,83.3,5983,810,0]
["Canada","Ontario","Burlington Piers","Burlington Piers, Ontario",853,2734,0,0,0,0,0,0,0,8.8000000000000007,80.7,6403,558,0]
["Canada","Ontario","Erieau","Erieau, Ontario",1029,2799,0,0,0,0,0,0,0,9.8000000000000007,77.099999999999994,6437,519,0]
["Canada","Ontario","Lagoon City","Lagoon City, Ontario",672,2724,0,0,0,0,0,0,0,-5.2,77.099999999999994,7969,339,0]
["Canada","Ontario","London Int'l Airport","London Int'l Airport, Ontario",638,2794,0,0,0,0,0,0,0,3.4,80.8,7172,420,0]
["Canada","Ontario","North Bay Airport","North Bay Airport, Ontario",448,2907,0,0,0,0,0,0,0,-12.9,76.400000000000006,9437,213,0]
["Canada","Ontario","Ottawa Macdonald-Cartier Int'l Airport","Ottawa Macdonald-Cartier Int'l Airport, Ontario",630,2730,0,0,0,0,0,0,0,-7.2,81.2,8213,425,0]
["Canada","Ontario","Peterborough Airport","Peterborough Airport, Ontario",395,2730,0,0,0,0,0,0,0,-4.7,80,7927,247,0]
["Canada","Ontario","Port Weller","Port Weller, Ontario",960,2854,0,0,0,0,0,0,0,11.6,79.400000000000006,6351,576,0]
["Canada","Ontario","Sault Ste Marie Airport","Sault Ste Marie Airport, Ontario",329,2976,0,0,0,0,0,0,0,-7.5,76.900000000000006,8989,163,0]
["Canada","Ontario","Sudbury Airport","Sudbury Airport, Ontario",425,2923,0,0,0,0,0,0,0,-13.3,78.2,9535,234,0]
["Canada","Ontario","Thunder Bay Airport","Thunder Bay Airport, Ontario",244,2982,0,0,0,0,0,0,0,-16.600000000000001,77.3,10139,125,0]
["Canada","Ontario","Timmins Victor Power Airport","Timmins Victor Power Airport, Ontario",277,2991,0,0,0,0,0,0,0,-23.1,78.099999999999994,10978,151,0]
["Canada","Ontario","Toronto Buttonville Airport","Toronto Buttonville Airport, Ontario",619,2773,0,0,0,0,0,0,0,1,82.5,7394,451,0]
["Canada","Ontario","Toronto Island Airport","Toronto Island Airport, Ontario",820,2825,0,0,0,0,0,0,0,8.1,77.5,6698,427,0]
["Canada","Ontario","Toronto Lester B. Pearson Int'l Airport","Toronto Lester B. Pearson Int'l Airport, Ontario",700,2756,0,0,0,0,0,0,0,3,82,7120,496,0]
["Canada","Ontario","Trenton Airport","Trenton Airport, Ontario",612,2700,0,0,0,0,0,0,0,-1.9,79.400000000000006,7526,367,0]
["Canada","Ontario","Welcome Island","Welcome Island, Ontario",328,3073,0,0,0,0,0,0,0,-10.6,70.7,9680,78,0]
["Canada","Ontario","Windsor Airport",{"$f":"C962&\", \"&B962","v":"Windsor Airport, Ontario"},956,2611,0,0,0,0,0,0,0,7.4,83.9,6267,753,0]
["Canada","Prince Edward Island","Charlottetown Airport","Charlottetown Airport, Prince Edward Island",412,3097,0,0,0,0,0,0,0,-0.6,74.900000000000006,8465,170,0]
["Canada","Québec","Bagotville Airport","Bagotville Airport, Québec",323,3004,0,0,0,0,0,0,0,-17.8,77.7,10365,171,0]
["Canada","Québec","Jonquiere","Jonquiere, Québec",333,2944,0,0,0,0,0,0,0,-16.3,77.599999999999994,9974,175,0]
["Canada","Québec","La Baie","La Baie, Québec",246,2965,0,0,0,0,0,0,0,-18.399999999999999,77.599999999999994,10303,129,0]
["Canada","Québec","Lac Saint-Pierre","Lac Saint-Pierre, Québec",630,2815,0,0,0,0,0,0,0,-8.4,76.7,8608,307,0]
["Canada","Québec","L'Acadie","L'Acadie, Québec",626,2641,0,0,0,0,0,0,0,-7.1,80.900000000000006,7933,415,0]
["Canada","Québec","L'Assomption","L'Assomption, Québec",549,2682,0,0,0,0,0,0,0,-9.1999999999999993,81,8291,366,0]
["Canada","Québec","Lennoxville","Lennoxville, Québec",433,2695,0,0,0,0,0,0,0,-8.6999999999999993,79.900000000000006,8277,269,0]
["Canada","Québec","Mctavish","Mctavish, Québec",800,2634,0,0,0,0,0,0,0,-3.2,81.099999999999994,7485,537,0]
["Canada","Québec","Mont-Joli Airport","Mont-Joli Airport, Québec",313,3250,0,0,0,0,0,0,0,-7.1,74.2,9763,120,0]
["Canada","Québec","Mont-Orford","Mont-Orford, Québec",349,3124,0,0,0,0,0,0,0,-12.9,71.599999999999994,10139,96,0]
["Canada","Québec","Montreal/Mirabel Int'l Airport","Montreal/Mirabel Int'l Airport, Québec",487,2778,0,0,0,0,0,0,0,-10.4,79.400000000000006,8729,292,0]
["Canada","Québec","Montreal/Pierre Elliott Trude","Montreal/Pierre Elliott Trude, Québec",693,2694,0,0,0,0,0,0,0,-6,80.8,7971,456,0]
["Canada","Québec","Montreal/St-Hubert Airport","Montreal/St-Hubert Airport, Québec",594,2727,0,0,0,0,0,0,0,-7.3,80.8,8215,391,0]
["Canada","Québec","Montreal-Est","Montreal-Est, Québec",736,2665,0,0,0,0,0,0,0,-5,81.599999999999994,7774,509,0]
["Canada","Québec","Nicolet","Nicolet, Québec",523,2743,0,0,0,0,0,0,0,-9.1,78.5,8468,294,0]
["Canada","Québec","Pointe-Au-Pere","Pointe-Au-Pere, Québec",141,3370,0,0,0,0,0,0,0,-3.3,68.400000000000006,9590,20,0]
["Canada","Québec","Quebec/Jean Lesage Int'l Airport","Quebec/Jean Lesage Int'l Airport, Québec",429,2915,0,0,0,0,0,0,0,-10.5,78.3,9169,238,0]
["Canada","Québec","Sherbrooke","Sherbrooke, Québec",304,2794,0,0,0,0,0,0,0,-13.2,78.2,9105,167,0]
["Canada","Québec","St-Anicet","St-Anicet, Québec",507,2667,0,0,0,0,0,0,0,-7.6,81,8068,338,0]
["Canada","Québec","Ste-Anne-De-Bellevue","Ste-Anne-De-Bellevue, Québec",619,2690,0,0,0,0,0,0,0,-6.4,80.7,8002,405,0]
["Canada","Québec","Ste-Foy","Ste-Foy, Québec",451,2871,0,0,0,0,0,0,0,-8,78.900000000000006,8732,261,0]
["Canada","Québec","Trois-Rivieres","Trois-Rivieres, Québec",665,2758,0,0,0,0,0,0,0,-6.7,77.2,8239,338,0]
["Canada","Québec","Varennes","Varennes, Québec",557,2719,0,0,0,0,0,0,0,-6.4,81,8088,371,0]
["Canada","Saskatchewan","Moose Jaw Airport","Moose Jaw Airport, Saskatchewan",384,2635,0,0,0,0,0,0,0,-22.6,82.8,9617,285,0]
["Canada","Saskatchewan","Moose Jaw","Moose Jaw, Saskatchewan",314,2793,0,0,0,0,0,0,0,-16.100000000000001,82.4,9439,228,0]
["Canada","Saskatchewan","Prince Albert Airport","Prince Albert Airport, Saskatchewan",227,2879,0,0,0,0,0,0,0,-28.3,78,11192,123,0]
["Canada","Saskatchewan","Regina Airport","Regina Airport, Saskatchewan",332,2780,0,0,0,0,0,0,0,-23.6,81.400000000000006,10262,227,0]
["Canada","Saskatchewan","Saskatoon Diefenbaker Int'l Airport","Saskatoon Diefenbaker Int'l Airport, Saskatchewan",298,2795,0,0,0,0,0,0,0,-25.6,80.2,10550,189,0]
["Canada","Saskatchewan","Saskatoon Kernen Farm","Saskatoon Kernen Farm, Saskatchewan",287,2898,0,0,0,0,0,0,0,-23,80.2,10626,182,0]
["Canada","Yukon Territory","Whitehorse Airport","Whitehorse Airport, Yukon Territory",47,3046,0,0,0,0,0,0,0,-31.5,70.099999999999994,12246,10,0]
[]
[]
[]
[]
["NOTES:"]
["1. Cooling degree days (CDD) and heating degree days (HDD) based on data from 2009 ASHRAE Fundamentals Handbook Chapter 14"]
["2. Cooling design condition based on 2% DB temperature in the 2009 ASHRAE Climatic Design Information Table (chapter F14 Appendix)"]
["3. Heating design condition based on 99% DB temperature in the 2009 ASHRAE Climatic Design Information Table (chapter F14 Appendix)"]
["4. Pollution numbers are non-baseload generation emmisions (http://www.epa.gov/cleanenergy/energy-resources/egrid/index.html) eGrid 2012 (2009 data)"]
["5. Energy prices based on Table 4 data from Energy Information Administration (www.eia.doe.gov) dated December 2013 (Data for 2012)"]
["6. CLH = (CDD65 x 24) / (summer design temp - 65) using formula 16G from Simplified Design of HVAC Systems by William Bobenhausen"]
["7. HLH = (HDD65 x 24) / (65 - winter design temp) using formula 16E from Simplified Design of HVAC Systems by William Bobenhausen"]
["8. 1 btu = 3.412142"]
["9. 12,000 btuh = 3.51685 kW"]
["10. Natural gas prices based on Energy Information Administration (EIA): Form EIA‐857, \"Monthly Report of Natural Gas Purchases and Deliveries to Consumers,\" released 4/30/2014 (data for 2012)"]
[]
[]
[]
[]
[]
["C — equals one hundred(100)."]
["Ccf — equals the volume of 100 cubic feet (cf) of natural gas."]
["M — equals one thousand (1,000)."]
["MM — equals one million (1,000,000)."]
["Mcf — equals the volume of 1,000 cubic feet (cf) of natural gas."]
["MMBtu — equals 1,000,000 British thermal units (Btu) (One Btu is the heat required to raise the temperature of one pound of water by one degree Fahrenheit.)."]
["Therm — One therm equals 100,000 Btu, or 0.10 MMBtu."]
[]
["In 2011, the average heat content of natural gas for the residential, commercial, and industrial sectors was about 1,023 Btu per cf; one Ccf = 102,300 Btu or 1.023 therms; one Mcf = 1.023 MMBtu or 10.23 therms."]
[]
["You can convert prices from one basis to another as follows:"]
["$ per Ccf divided by 1.023 = $ per therm"]
["$ per therm multiplied by 1.023 = $ per Ccf"]
["$ per Mcf divided by 1.023 = $ per MMBtu"]
["$ per Mcf divided by 10.23 = $ per therm"]
["$ per MMBtu multiplied by 1.023 = $ per Mcf"]
["$ per therm multiplied by 10.23 = $ per Mcf"]

{"sheet":"Lists","index":2,"n_rows":103,"n_cols":7,"rows_kept":103,"cut":false,"hidden":true,"merged":[]}
["Country","USA State","Canada State",null,"Manufacturer",null,"Loop Type"]
["USA","Alabama","Alberta",null,"ClimateMaster",null,"Water Loop"]
["Canada","Alaska","British Columbia",null,"Florida Heat Pump",null,"Ground Water"]
[null,"Arizona","Manitoba",null,"Johnson Controls",null,"Geothermal"]
[null,"Arkansas","New Brunswick",null,"Mammoth",null,"Air Source"]
[null,"California","Newfoundland",null,"McQuay"]
[null,"Colorado","Northwest Territories",null,"Rittling"]
[null,"Connecticut","Nova Scotia",null,"Trane"]
[null,"Delaware","Nunavut",null,"Waterfurnace"]
[null,"Florida","Ontario",null,"Whalen"]
[null,"Georgia","Prince Edward Island",null,"Generic Air Source"]
[null,"Hawaii","Québec",null,"Generic WSHP"]
[null,"Idaho","Saskatchewan"]
[null,"Illinois","Yukon Territory"]
[null,"Indiana",null,null,"Manufacturer","Model"]
[null,"Iowa",null,null,"ClimateMaster","TC"]
[null,"Kansas",null,null,"ClimateMaster","TE 2-stage"]
[null,"Kentucky",null,null,"ClimateMaster","THW"]
[null,"Louisiana",null,null,"ClimateMaster","TL"]
[null,"Maine",null,null,"ClimateMaster","TMW"]
[null,"Maryland",null,null,"ClimateMaster","TR"]
[null,"Massachusetts",null,null,"ClimateMaster","TRC"]
[null,"Michigan",null,null,"ClimateMaster","TRE"]
[null,"Minnesota",null,null,"ClimateMaster","TRM"]
[null,"Mississippi",null,null,"ClimateMaster","TS"]
[null,"Missouri",null,null,"ClimateMaster","TSM"]
[null,"Montana",null,null,"ClimateMaster","TT 2-stage"]
[null,"Nebraska",null,null,"ClimateMaster","TY 2-stage"]
[null,"Nevada",null,null,"ClimateMaster","TZ 2-stage"]
[null,"New Hampshire",null,null,"Florida Heat Pump","CA"]
[null,"New Jersey",null,null,"Florida Heat Pump","EC"]
[null,"New Mexico",null,null,"Florida Heat Pump","EP"]
[null,"New York",null,null,"Florida Heat Pump","ES"]
[null,"North Carolina",null,null,"Florida Heat Pump","ES 2-stage"]
[null,"North Dakota",null,null,"Florida Heat Pump","EV"]
[null,"Ohio",null,null,"Florida Heat Pump","LM 2-stage"]
[null,"Oklahoma",null,null,"Florida Heat Pump","LV"]
[null,"Oregon",null,null,"Florida Heat Pump","MC"]
[null,"Pennsylvania",null,null,"Florida Heat Pump","TRS"]
[null,"Rhode Island",null,null,"Florida Heat Pump","WW"]
[null,"South Carolina",null,null,"Johnson Controls","RBS"]
[null,"South Dakota",null,null,"Johnson Controls","RC"]
[null,"Tennessee",null,null,"Johnson Controls","RGS"]
[null,"Texas",null,null,"Johnson Controls","RJS"]
[null,"Utah",null,null,"Johnson Controls","RJT 2-stage"]
[null,"Vermont",null,null,"Johnson Controls","RKS"]
[null,"Virginia",null,null,"Johnson Controls","RKT 2-stage"]
[null,"Washington",null,null,"Johnson Controls","RL"]
[null,"West Virginia",null,null,"Johnson Controls","RS"]
[null,"Wisconsin",null,null,"Johnson Controls","VSC"]
[null,"Wyoming",null,null,"Mammoth","HHA / HLA"]
[null,null,null,null,"Mammoth","HHA / HLA 2-stage"]
[null,null,null,null,"Mammoth","HHM / HLM"]
[null,null,null,null,"Mammoth","HHU / HLU"]
[null,null,null,null,"Mammoth","VHA / VLA"]
[null,null,null,null,"Mammoth","VHA / VLA 2-stage"]
[null,null,null,null,"Mammoth","VHB / VLB"]
[null,null,null,null,"Mammoth","VHM / VLM"]
[null,null,null,null,"Mammoth","VHU / VLU"]
[null,null,null,null,"Mammoth","WHK / WLK"]
[null,null,null,null,"McQuay","WCCH / WCCW"]
[null,null,null,null,"McQuay","WDFW Variable Speed"]
[null,null,null,null,"McQuay","WGS"]
[null,null,null,null,"McQuay","WGT 2-stage"]
[null,null,null,null,"McQuay","WLVC  WLVW"]
[null,null,null,null,"McQuay","WMHC / WMHW"]
[null,null,null,null,"McQuay","WRWA / WRGA"]
[null,null,null,null,"McQuay","WRWC / WRGC"]
[null,null,null,null,"McQuay","WVFC / WVFW"]
[null,null,null,null,"McQuay","WVHC"]
[null,null,null,null,"McQuay","WWCA"]
[null,null,null,null,"McQuay","WWHA"]
[null,null,null,null,"McQuay","WWRA"]
[null,null,null,null,"Rittling","VHC"]
[null,null,null,null,"Trane","DXH 2-stage"]
[null,null,null,null,"Trane","DXV 2-stage"]
[null,null,null,null,"Trane","EXH"]
[null,null,null,null,"Trane","EXV"]
[null,null,null,null,"Trane","EXW"]
[null,null,null,null,"Trane","GEC"]
[null,null,null,null,"Trane","GEH"]
[null,null,null,null,"Trane","GER"]
[null,null,null,null,"Trane","GET"]
[null,null,null,null,"Trane","GEV"]
[null,null,null,null,"Trane","TCT 2-stage"]
[null,null,null,null,"Trane","VSH Variable Speed"]
[null,null,null,null,"Trane","VSV Variable Speed"]
[null,null,null,null,"Waterfurnace","LCC"]
[null,null,null,null,"Waterfurnace","NB"]
[null,null,null,null,"Waterfurnace","NB 2-stage"]
[null,null,null,null,"Waterfurnace","NCC"]
[null,null,null,null,"Waterfurnace","ND 2-stage"]
[null,null,null,null,"Waterfurnace","NDW 2-stage"]
[null,null,null,null,"Waterfurnace","NL / NX"]
[null,null,null,null,"Waterfurnace","NSW"]
[null,null,null,null,"Waterfurnace","NXW 2-stage"]
[null,null,null,null,"Waterfurnace","UB"]
[null,null,null,null,"Waterfurnace","US"]
[null,null,null,null,"Whalen","VI"]
[null,null,null,null,"Generic Air Source","10 EER Air Source"]
[null,null,null,null,"Generic Air Source","12 EER Air Source"]
[null,null,null,null,"Generic WSHP","10 EER WSHP"]
[null,null,null,null,"Generic WSHP","12 EER WSHP"]

{"sheet":"AHRI Ratings","index":3,"n_rows":909,"n_cols":26,"rows_kept":909,"cut":false,"hidden":true,"merged":[]}
["Manufacturer","Series","Model","Size","Stages","WLHP Cooling Capacity (Btuh)","WLHP Cooling EER (Btuh/Watt)","WLHP Cooling Fluid Flow Rate (Gpm)","WLHP Heating Capacity (Btuh)","WLHP Heating COP","WLHP Heating Fluid Flow Rate (Gpm)","GWHP Cooling Capacity (Btuh)","GWHP Cooling EER (Btuh/Watt)","GWHP Cooling Fluid Flow Rate (Gpm)","GWHP Heating Capacity (Btuh)","GWHP Heating COP","GWHP Heating Fluid Flow Rate (Gpm)","GLHP Cooling Capacity (Btuh)","GLHP Cooling EER (Btuh/Watt)","GLHP Cooling Fluid Flow Rate (Gpm)","GLHP Heating Capacity (Btuh)","GLHP Heating COP","GLHP Heating Fluid Flow Rate (Gpm)","# of Stages","Motor Type","Last Date Modified"]
["ClimateMaster","TC","TCH072AF","072","Full",69000,13.3,20,92500,5,20,78500,19.7,20,75500,4.4000000000000004,20,71000,14.6,20,58000,3.5,20,"1-Stage","Belt Drive","2013-04-10"]
["ClimateMaster","TC","TCH096AF","096","Full",95000,13.7,24,123000,5,24,104500,20,24,101000,4.4000000000000004,24,98000,15.2,24,77000,3.6,24,"1-Stage","Belt Drive","2013-04-10"]
["ClimateMaster","TC","TCH120AF","120","Full",119000,13.3,30,160000,4.5999999999999996,30,134000,19.3,30,132500,4,30,122500,14.5,30,103000,3.3,30,"1-Stage","Belt Drive","2013-04-10"]
["ClimateMaster","TC","TCV072AF","072","Full",69000,13.3,20,92500,5,20,78500,19.7,20,75500,4.4000000000000004,20,71000,14.6,20,58000,3.5,20,"1-Stage","Belt Drive","2013-04-10"]
["ClimateMaster","TC","TCV096AF","096","Full",95000,13.7,24,123000,5,24,104500,20,24,101000,4.4000000000000004,24,98000,15.2,24,77000,3.6,24,"1-Stage","Belt Drive","2013-04-10"]
["ClimateMaster","TC","TCV120AF","120","Full",119000,13.3,30,160000,4.5999999999999996,30,134000,19.3,30,132500,4,30,122500,14.5,30,103000,3.3,30,"1-Stage","Belt Drive","2013-04-10"]
["ClimateMaster","TC","TCV168AF","168","Full",157000,14.2,42,207000,4.9000000000000004,42,172000,19.600000000000001,42,168000,4.4000000000000004,42,162000,15.2,42,125000,3.5,42,"1-Stage","Belt Drive","2013-04-10"]
["ClimateMaster","TC","TCV192AF","192","Full",191500,14.3,48,243000,5.0999999999999996,48,211000,19.5,48,196500,4.5,48,199000,15.8,48,149000,3.7,48,"1-Stage","Belt Drive","2013-04-10"]
["ClimateMaster","TC","TCV240AF","240","Full",233000,13.9,60,318000,5,60,263500,19.2,60,260500,4.4000000000000004,60,240000,14.8,60,198500,3.5,60,"1-Stage","Belt Drive","2013-04-10"]
["ClimateMaster","TC","TCV300AF","300","Full",300000,13.5,75,395000,4.8,75,341500,18.7,75,321500,4.3,75,310000,14.5,75,240000,3.4,75,"1-Stage","Belt Drive","2013-04-10"]
["ClimateMaster","TC","TCH/V006AE","006","Full",5800,13.2,2,7500,4.7,2,6900,21.1,2,6200,4,2,6200,15.4,2,4900,3.4,2,"1-Stage","PSC","2013-04-10"]
["ClimateMaster","TC","TCH/V009AE","009","Full",8800,13.4,2.6,11600,4.2,2.6,10100,21,2.6,9800,3.9,2.6,9300,15.7,2.6,7900,3.4,2.6,"1-Stage","PSC","2013-04-10"]
["ClimateMaster","TC","TCH/V012AE","012","Full",11700,13.5,3.5,15200,4.3,3.5,13700,20.8,3.5,12500,3.8,3.5,12000,14.9,3.5,9900,3.2,3.5,"1-Stage","PSC","2013-04-10"]
["ClimateMaster","TC","TCH/V015AE","015","Full",14500,15.4,4,17300,5,4,16800,24.5,4,14400,4.4000000000000004,4,15000,17.2,4,11100,3.6,4,"1-Stage","PSC","2013-04-10"]
["ClimateMaster","TC","TCH/V018AE","018","Full",17300,14.3,4.5,21500,5,4.5,20600,24.2,4.5,17200,4.4000000000000004,4.5,18400,16.3,4.5,13900,3.4,4.5,"1-Stage","PSC","2013-04-10"]
["ClimateMaster","TC","TCH/V024AF","024","Full",23700,13.4,6.5,28500,4.7,6.5,26700,20.9,6.5,24000,4.0999999999999996,6.5,24900,15.4,6.5,18500,3.3,6.5,"1-Stage","PSC","2013-04-10"]
["ClimateMaster","TC","TCH/V030AF","030","Full",28100,13.4,8,35100,4.5999999999999996,8,31700,20.100000000000001,8,29600,4.0999999999999996,8,28900,15.1,8,23400,3.4,8,"1-Stage","PSC","2013-04-10"]
["ClimateMaster","TC","TCH/V036AF","036","Full",34500,13.5,9.5,45200,4.4000000000000004,9.5,38700,20.7,9.5,37500,4,9.5,35300,14.9,9.5,29600,3.3,9.5,"1-Stage","PSC","2013-04-10"]
["ClimateMaster","TC","TCH/V042AF","042","Full",40100,13.1,11.25,52700,4.3,11.25,45900,19.600000000000001,11.25,44000,3.8,11.25,40500,14.4,11.25,34300,3.3,11.25,"1-Stage","PSC","2013-04-10"]
["ClimateMaster","TC","TCH/V048AF","048","Full",47700,13.3,13,55900,4.7,13,54300,20.5,13,46500,4.0999999999999996,13,49000,14.7,13,36400,3.4,13,"1-Stage","PSC","2013-04-10"]
["ClimateMaster","TC","TCH/V060AF","060","Full",59400,13.4,16,72000,4.3,8,66600,19.899999999999999,16,60000,3.9,8,60100,14.8,16,47500,3.3,8,"1-Stage","PSC","2013-04-10"]
["ClimateMaster","TC","TCV041AF","041","Full",36500,13.1,10,45700,4.2,10,41400,19.7,10,38000,3.7,10,38000,14.8,10,30100,3.1,10,"1-Stage","PSC","2013-04-10"]
["ClimateMaster","TE 2-stage","TEV/H/D026","026","Full",25300,17.7,8,30400,5.7,8,28700,27.3,8,24800,5,8,26300,19.899999999999999,8,18900,4,8,"2-Stage","ECM - CA","2013-04-10"]
["ClimateMaster","TE 2-stage","TEV/H/D038","038","Full",38000,17.8,9,45100,5.8,9,43300,27.1,9,37200,5.2,9,39900,20.3,9,29200,4.4000000000000004,9,"2-Stage","ECM - CA","2013-04-10"]
["ClimateMaster","TE 2-stage","TEV/H/D049","049","Full",48700,17.3,12,59700,5.5,12,55800,26.1,12,48400,4.8,12,50800,19.3,12,37200,4,12,"2-Stage","ECM - CA","2013-04-10"]
["ClimateMaster","TE 2-stage","TEV/H/D064","064","Full",61500,16.2,15,77400,5.4,15,71500,24.4,15,63200,4.8,15,66200,18.8,15,48700,3.9,15,"2-Stage","ECM - CA","2013-04-10"]
["ClimateMaster","TE 2-stage","TEV/H/D072","072","Full",68300,15.1,17,85300,4.8,17,77700,22.5,17,71400,4.4000000000000004,17,71700,16.899999999999999,17,55800,3.7,17,"2-Stage","ECM - CA","2013-04-10"]
["ClimateMaster","THW","THW010","010","Full",0,0,0,48200,4.9000000000000004,10,0,0,0,38800,4,10,0,0,0,30800,3.2,10,"1-Stage","NA","2013-04-10"]
["ClimateMaster","TL","TLV084*F","084","Full",82000,15.2,21,101000,4.8,21,87500,21,21,83500,4.3,21,83000,16.5,21,65500,3.6,21,"1-Stage","Belt Drive","2013-04-10"]
["ClimateMaster","TL","TLV096*F","096","Full",94000,15,24,118000,4.7,24,102500,20.5,24,96500,4.2,24,97500,16.5,24,76500,3.6,24,"1-Stage","Belt Drive","2013-04-10"]
["ClimateMaster","TL","TLV120*F","120","Full",118000,15,30,144000,5,30,133000,21,30,118000,4.2,30,120000,16.5,30,93000,3.7,30,"1-Stage","Belt Drive","2013-04-10"]
["ClimateMaster","TL","TLV150*F","150","Full",134000,13.8,38,172000,4.5999999999999996,38,150500,20,38,140000,4,38,139000,15.5,38,109000,3.3,38,"1-Stage","Belt Drive","2013-04-10"]
["ClimateMaster","TL","TLV168*F","168","Full",175000,15,42,206699.99999999997,5,42,187000,20.9,42,168000,4.5,42,177500,16.5,42,129500,3.7,42,"1-Stage","Belt Drive","2013-04-10"]
["ClimateMaster","TL","TLV192*F","192","Full",241000,13.6,48,287000,4.8,48,276000,19.3,48,230000,4.1500000000000004,48,249500,15,48,182400,3.4,48,"1-Stage","Belt Drive","2013-04-10"]
["ClimateMaster","TL","TLV240*F","240","Full",238500,15.3,60,291000,5.0999999999999996,60,269000,21.4,60,238500,4.3,60,242500,16.8,60,188000,3.8,60,"1-Stage","Belt Drive","2013-04-10"]
["ClimateMaster","TL","TLV300*F","300","Full",300000,14,76,372000,4.7,76,340000,20,76,310000,4.2,76,312000,15.8,76,244000,3.6,76,"1-Stage","Belt Drive","2013-04-10"]
["ClimateMaster","TMW","TMW036AF","036","Full",32300,14.6,9,43100,4.9000000000000004,9,36200,23.1,9,35300,4,9,33300,16.399999999999999,9,27400,3.1,9,"1-Stage","NA","2013-04-10"]
["ClimateMaster","TMW","TMW060BH","060","Full",52800,14.3,15,72700,4.7,15,56600,20.3,15,60300,4,15,55600,16.2,15,48500,3.1,15,"1-Stage","NA","2013-04-10"]
["ClimateMaster","TMW","TMW120BH","120","Full",105600,14.1,30,145400,4.5999999999999996,30,113200,20.100000000000001,30,120600,3.9,30,111200,16.100000000000001,30,97000,3.1,30,"1-Stage","NA","2013-04-10"]
["ClimateMaster","TMW","TMW170BH","170","Full",123500,13.3,35,164600,4.3,35,138400,19.3,35,136200,3.7,35,130300,15.3,35,108600,2.9,35,"1-Stage","NA","2013-04-10"]
["ClimateMaster","TMW","TMW340BH","340","Full",254000,13.6,70,336000,4.4000000000000004,70,282000,19.600000000000001,70,277000,3.7,70,267000,15.6,70,220000,3,70,"1-Stage","NA","2013-04-10"]
["ClimateMaster","TMW","TMW360BH","360","Full",380300,16,90,531000,5.0999999999999996,90,438000,24.2,90,416000,4.2,90,399600.00000000006,18.399999999999999,90,316000,3.4,90,"1-Stage","NA","2013-04-10"]
["ClimateMaster","TMW","TMW600BH","600","Full",619800,16,150,873000,5.2,150,707400,23.2,150,680000,4.3,150,649600,18.2,150,517000,3.4,150,"1-Stage","NA","2013-04-10"]
["ClimateMaster","TMW","TMW840BH","840","Full",814799.99999999988,16.2,210,1141000,5.3,210,925700,23.3,210,894000,4.4000000000000004,210,852600,18.399999999999999,210,677000,3.4,210,"1-Stage","NA","2013-04-10"]
["ClimateMaster","TR","TRH/V006AE","006","Full",5800,13.2,2,7500,4.7,2,6900,21,2,6200,4,2,6200,15.4,2,4900,3.4,2,"1-Stage","PSC","2013-04-10"]
["ClimateMaster","TR","TRH/V009AE","009","Full",8800,13.4,2.6,11600,4.2,2.6,10100,21,2.6,9800,3.9,2.6,9300,15.7,2.6,7900,3.4,2.6,"1-Stage","PSC","2013-04-10"]
["ClimateMaster","TR","TRH/V012AE","012","Full",11700,13.5,3.5,15200,4.3,3.5,13700,20.8,3.5,12500,3.8,3.5,12000,14.9,3.5,9900,3.2,3.5,"1-Stage","PSC","2013-04-10"]
["ClimateMaster","TR","TRH/V015AE","015","Full",14500,15.4,4,17300,5,4,16800,24.5,4,14400,4.4000000000000004,4,15000,17.2,4,11100,3.6,4,"1-Stage","PSC","2013-04-10"]
["ClimateMaster","TR","TRH/V018AE","018","Full",17300,14.3,4.5,21500,5,4.5,20600,24.2,4.5,17200,4.4000000000000004,4.5,18400,16.3,4.5,13900,3.4,4.5,"1-Stage","PSC","2013-04-10"]
["ClimateMaster","TR","TRH/V024AE","024","Full",23700,13.4,6.5,28500,4.7,6.5,26700,20.9,6.5,24000,4.0999999999999996,6.5,24900,15.4,6.5,18500,3.3,6.5,"1-Stage","PSC","2013-04-10"]
["ClimateMaster","TR","TRH/V030AF","030","Full",28100,13.4,8,35100,4.5999999999999996,8,31700,20.100000000000001,8,29600,4.0999999999999996,8,28900,15.1,8,23400,3.4,8,"1-Stage","PSC","2013-04-10"]
["ClimateMaster","TR","TRH/V036AF","036","Full",34500,13.5,9.5,45200,4.4000000000000004,9.5,38700,20.7,9.5,37500,4,9.5,35300,14.9,9.5,29600,3.3,9.5,"1-Stage","PSC","2013-04-10"]
["ClimateMaster","TR","TRH/V042AF","042","Full",40100,13.1,11.25,52700,4.3,11.25,45900,19.600000000000001,11.25,44000,3.8,11.25,40500,14.4,11.25,34300,3.3,11.25,"1-Stage","PSC","2013-04-10"]
["ClimateMaster","TR","TRH/V048AF","048","Full",47700,13.3,13,55900,4.7,13,54300,20.5,13,46500,4.0999999999999996,13,49000,14.7,13,36400,3.4,13,"1-Stage","PSC","2013-04-10"]
["ClimateMaster","TR","TRH/V060AF","060","Full",59400,13.4,16,72000,4.3,8,66600,19.899999999999999,16,60000,3.9,8,60100,14.8,16,47500,3.3,8,"1-Stage","PSC","2013-04-10"]
["ClimateMaster","TRC","TRC09G","009","Full",8600,13.3,2.8,11400,4.5999999999999996,2.8,9200,18.600000000000001,2.8,9500,4,2.8,8800,14.9,2.8,7300,3.3,2.8,"1-Stage","PSC","2013-04-10"]
["ClimateMaster","TRC","TRC12G","012","Full",11300,13.3,3.5,14900,4.9000000000000004,3.5,12500,18.7,3.5,12100,4.0999999999999996,3.5,11800,15.1,3.5,9300,3.3,3.5,"1-Stage","PSC","2013-04-10"]
["ClimateMaster","TRC","TRC15G","015","Full",14100,13.5,4.2,18200,5.0999999999999996,4.2,16600,21.3,4.2,14800,4.3,4.2,15100,15.8,4.2,11400,3.5,4.2,"1-Stage","PSC","2013-04-10"]
["ClimateMaster","TRC","TRC18G","018","Full",15600,13,5,20100,4.5,5,17600,19.5,5,16500,4,5,16500,15,5,13200,3.4,5,"1-Stage","PSC","2013-04-10"]
["ClimateMaster","TRE","TRE036*F","036","Full",35000,14.2,9,42700,5,9,39800,21.7,9,35400,4.4000000000000004,9,35000,16.5,9,28100,3.6,9,"1-Stage","Belt Drive","2013-04-10"]
["ClimateMaster","TRE","TRE048*F","048","Full",48500,14.4,12,59700,4.7,12,54800,21.1,12,48500,4.0999999999999996,12,50000,16,12,37800,3.4,12,"1-Stage","Belt Drive","2013-04-10"]
["ClimateMaster","TRE","TRE060*F","060","Full",61100,15.7,16,72800,5.0999999999999996,16,69800,23.5,16,60100,4.5,16,62100,17.600000000000001,16,45600,3.6,16,"1-Stage","Belt Drive","2013-04-10"]
["ClimateMaster","TRE","TRE072*F","072","Full",71000,15,18,88500,5,18,79000,23,18,72000,4.4000000000000004,18,71000,16.2,18,55000,3.6,18,"1-Stage","Belt Drive","2013-04-10"]
["ClimateMaster","TRE","TRE096*F","096","Full",97000,14,24,110600,4.4000000000000004,24,108600,20.6,24,91700,3.9,24,101000,15.6,24,74000,3.2,24,"1-Stage","Belt Drive","2013-04-10"]
["ClimateMaster","TRE","TRE120*F","120","Full",122500,13.9,30,149400,4.4000000000000004,30,135000,20.6,30,122700,3.9,30,129000,15.6,30,98000,3.2,30,"1-Stage","Belt Drive","2013-04-10"]
["ClimateMaster","TRE","TRE144*F","144","Full",141000,13.8,36,180000,4.5,36,158000,20,36,145000,4,36,144000,15.2,36,113000,3.3,36,"1-Stage","Belt Drive","2013-04-10"]
["ClimateMaster","TRE","TRE168*F","168","Full",175000,15,42,206699.99999999997,5,42,187000,20.9,42,168000,4.5,42,177500,16.5,42,129500,3.7,42,"1-Stage","Belt Drive","2013-04-10"]
["ClimateMaster","TRE","TRE240*F","240","Full",241000,13.6,60,287000,4.8,60,276000,19.3,60,230000,4.1500000000000004,60,249500,15,60,182400,3.4,60,"1-Stage","Belt Drive","2013-04-10"]
["ClimateMaster","TRM","TRM09G","009","Full",8800,13,3,12500,4.5999999999999996,3,10100,19.5,3,9800,3.8,3,9300,14.7,3,7200,3.1,3,"1-Stage","PSC","2013-04-10"]
["ClimateMaster","TRM","TRM12G","012","Full",11600,13,3.9,15800,4.5,3.9,13700,20,3.9,12700,3.8,3.9,12200,15,3.9,9500,3.1,3.9,"1-Stage","PSC","2013-04-10"]
["ClimateMaster","TRM","TRM15G","015","Full",13800,13,5.4,19600,4.7,5.4,16500,20,5.4,15500,3.9,5.4,15200,14.6,5.4,11500,3.1,5.4,"1-Stage","PSC","2013-04-10"]
["ClimateMaster","TRM","TRM18G","018","Full",16700,13,6.8,22600,4.7,6.8,19600,19.5,6.8,18200,3.8,6.8,17600,14.6,6.8,14000,3.1,6.8,"1-Stage","PSC","2013-04-10"]
["ClimateMaster","TRM","TRM24G","024","Full",22100,13,8.1999999999999993,29400,4.5,8.1999999999999993,26400,20,8.1999999999999993,23100,3.8,8.1999999999999993,23600,14.8,8.1999999999999993,18000,3.1,8.1999999999999993,"1-Stage","PSC","2013-04-10"]
["ClimateMaster","TRM","TRM30G","030","Full",27100,13,9.8000000000000007,33100,4.5999999999999996,9.8000000000000007,30600,18.600000000000001,9.8000000000000007,27700,4,9.8000000000000007,29200,16,9.8000000000000007,20600,3.1,9.8000000000000007,"1-Stage","PSC","2013-04-10"]
["ClimateMaster","TRM","TRM36G","036","Full",32000,12.5,10,39500,4.5999999999999996,10,36700,18.8,10,32000,3.8,10,33000,14.3,10,25000,3.1,10,"1-Stage","PSC","2013-04-10"]
["ClimateMaster","TS","TSV/TSH/TSD018BGK","018","Full",19200,16.5,5.5,23300,5.9,5.5,22100,26.3,5.5,18900,4.9000000000000004,5.5,20200,19.399999999999999,5.5,14500,3.9,5.5,"1-Stage","ECM - CA","2013-04-10"]
["ClimateMaster","TS","TSV/TSH/TSD024CGK","024","Full",23900,17.899999999999999,8,30400,6.1,8,26900,28.5,8,23800,5.2,8,25500,20.9,8,19100,4.2,8,"1-Stage","ECM - CA","2013-04-10"]
["ClimateMaster","TS","TSV/TSH/TSD030CGK","030","Full",28000,17.3,8,35100,5.8,8,30800,26.7,8,28000,4.9000000000000004,8,29200,19.399999999999999,8,22000,4.0999999999999996,8,"1-Stage","ECM - CA","2013-04-10"]
["ClimateMaster","TS","TSV/TSH/TSD036CGK","036","Full",33500,18.100000000000001,9,39900,5.9,9,35400,24.9,9,32600,4.9000000000000004,9,34600,20.399999999999999,9,25600,4.3,9,"1-Stage","ECM - CA","2013-04-10"]
["ClimateMaster","TS","TSV/TSH/TSD042CGK","042","Full",39400,19.600000000000001,11,45100,6,11,44400,29.5,11,35200,5.2,11,40700,21.9,11,27400,4.0999999999999996,11,"1-Stage","ECM - CA","2013-04-10"]
["ClimateMaster","TS","TSV/TSH/TSD048CGK","048","Full",48900,17.2,12,57700,5.2,12,53700,23.9,12,45700,4.4000000000000004,12,50600,18.8,12,36100,3.7,12,"1-Stage","ECM - CA","2013-04-10"]
["ClimateMaster","TS","TSV/TSH/TSD060CGK","060","Full",63200,17.2,15,73200,5.4,15,68900,24.9,15,58200,4.5999999999999996,15,64400,18.399999999999999,15,46400,3.9,15,"1-Stage","ECM - CA","2013-04-10"]
["ClimateMaster","TS","TSV/TSH/TSD070CGK","070","Full",71100,15.7,16.5,82000,4.8,16.5,78100,23,16.5,65200,4.0999999999999996,16.5,73000,17.2,16.5,53000,3.6,16.5,"1-Stage","ECM - CA","2013-04-10"]
["ClimateMaster","TS","TSV/TSH/TSD018BE","018","Full",18600,15,5.5,23000,5.2,5.5,21300,24.8,5.5,18600,4.5,5.5,19500,18.399999999999999,5.5,14500,3.6,5.5,"1-Stage","PSC","2013-04-10"]
["ClimateMaster","TS","TSV/TSH/TSD024CF","024","Full",23800,16.899999999999999,8,30800,5.9,8,26500,26.4,8,24100,5,8,25300,18.899999999999999,8,19200,4,8,"1-Stage","PSC","2013-04-10"]
["ClimateMaster","TS","TSV/TSH/TSD030CF","030","Full",28000,16.3,8,35500,5.5,8,31000,24.9,8,28400,4.7,8,29200,18.5,8,22200,3.9,8,"1-Stage","PSC","2013-04-10"]
["ClimateMaster","TS","TSV/TSH/TSD036CF","036","Full",33400,17,9,40400,5.6,9,35400,23.2,9,33200,4.7,9,34300,19.2,9,25900,4.0999999999999996,9,"1-Stage","PSC","2013-04-10"]
["ClimateMaster","TS","TSV/TSH/TSD042CF","042","Full",38500,17.2,11,46300,5.6,11,43700,25.4,11,36200,4.7,11,40100,19.399999999999999,11,28700,3.8,11,"1-Stage","PSC","2013-04-10"]
["ClimateMaster","TS","TSV/TSH/TSD048CF","048","Full",47100,14.8,12,58000,4.7,12,53600,21.3,12,47500,4,12,49600,16.8,12,36600,3.4,12,"1-Stage","PSC","2013-04-10"]
["ClimateMaster","TS","TSV/TSH/TSD060CF","060","Full",62400,15.9,15,73900,5,15,68500,23.1,15,58200,4.2,15,63900,17.2,15,46900,3.7,15,"1-Stage","PSC","2013-04-10"]
["ClimateMaster","TS","TSV/TSH/TSD070CF","070","Full",71000,14.6,16.5,82100,4.5999999999999996,16.5,78000,21.1,16.5,66100,4,16.5,72900,16.2,16.5,53800,3.4,16.5,"1-Stage","PSC","2013-04-10"]
["ClimateMaster","TS","TSV/TSH006AE","006","Full",6300,15.7,2,8000,5.4,2,7400,25.5,2,6300,4.4000000000000004,2,6700,18.5,2,4800,3.4,2,"1-Stage","PSC","2013-04-10"]
["ClimateMaster","TS","TSV/TSH009AE","009","Full",9300,15.3,2.75,11100,4.8,2.75,11100,25.2,2.75,9400,4.3,2.75,10000,18.100000000000001,2.75,7100,3.4,2.75,"1-Stage","PSC","2013-04-10"]
["ClimateMaster","TS","TSV/TSH012AE","012","Full",11700,15.4,3.5,13800,4.5,3.5,13300,24.6,3.5,11800,4,3.5,12300,18.100000000000001,3.5,9500,3.5,3.5,"1-Stage","PSC","2013-04-10"]
["ClimateMaster","TSM","TSM09G *B","009","Full",9800,15,3,12900,5.4,3,11700,24.5,3,10300,4.5,3,10500,17.8,3,7400,3.4,3,"1-Stage","ECM - CA","2013-04-10"]
["ClimateMaster","TSM","TSM12G *B","012","Full",11600,14.7,3.5,16000,5.2,3.5,13600,23.8,3.5,12900,4.4000000000000004,3.5,12300,17.2,3.5,9600,3.4,3.5,"1-Stage","ECM - CA","2013-04-10"]
["ClimateMaster","TSM","TSM15G *B","015","Full",14600,15.9,4.5,17500,5.3,4.5,16800,25.6,4.5,14500,4.5,4.5,15500,18.8,4.5,11000,3.6,4.5,"1-Stage","ECM - CA","2013-04-10"]
["ClimateMaster","TSM","TSM18G *B","018","Full",18000,15.2,6.8,22200,5.0999999999999996,6.8,20000,23.5,6.8,17700,4.4000000000000004,6.8,18500,17.3,6.8,13200,3.3,6.8,"1-Stage","ECM - CA","2013-04-10"]
["ClimateMaster","TSM","TSM24G *B","024","Full",25000,15.7,8,32500,5.0999999999999996,8,29500,25.3,8,26000,4.5,8,26500,18.5,8,18200,3.5,8,"1-Stage","ECM - CA","2013-04-10"]
["ClimateMaster","TSM","TSM30G *B","030","Full",28000,15.1,8,34500,5,8,31500,22.9,8,28500,4.4000000000000004,8,29000,17.600000000000001,8,22200,3.6,8,"1-Stage","ECM - CA","2013-04-10"]
["ClimateMaster","TSM","TSM36G *B","036","Full",37500,14.6,9,44000,5,9,42500,22.6,9,36000,4.3,9,38500,16.5,9,28000,3.5,9,"1-Stage","ECM - CA","2013-04-10"]
["ClimateMaster","TSM","TSM09G *A","009","Full",9700,13.9,3,12700,5.2,3,11500,22.1,3,10400,4.3,3,10300,16.2,3,7600,3.2,3,"1-Stage","PSC","2013-04-10"]
["ClimateMaster","TSM","TSM12G *A","012","Full",11400,13.8,3.5,16000,5.0999999999999996,3.5,13500,21.8,3.5,13000,4.3,3.5,12200,16,3.5,9700,3.3,3.5,"1-Stage","PSC","2013-04-10"]
["ClimateMaster","TSM","TSM15G *A","015","Full",14300,13.3,4.5,18000,4.8,4.5,16500,20.5,4.5,14500,4.0999999999999996,4.5,15200,15.6,4.5,11500,3.3,4.5,"1-Stage","PSC","2013-04-10"]
["ClimateMaster","TSM","TSM18G *A","018","Full",17300,13.2,6.8,22500,4.8,6.8,20000,20,6.8,18000,4,6.8,18400,15.1,6.8,13500,3.2,6.8,"1-Stage","PSC","2013-04-10"]
["ClimateMaster","TSM","TSM24G *A","024","Full",25000,14.4,8,32500,4.9000000000000004,8,29000,22.5,8,26500,4.3,8,26500,16.8,8,18400,3.4,8,"1-Stage","PSC","2013-04-10"]
["ClimateMaster","TSM","TSM30G *A","030","Full",27500,13.4,8,34500,4.7,8,31000,19.5,8,28500,4.0999999999999996,8,28500,15.2,8,22000,3.3,8,"1-Stage","PSC","2013-04-10"]
["ClimateMaster","TSM","TSM36G *A","036","Full",37500,14.1,9,44500,4.9000000000000004,9,42500,21.5,9,36500,4.3,9,38500,16.2,9,28500,3.4,9,"1-Stage","PSC","2013-04-10"]
["ClimateMaster","TT 2-stage","TTV/TTH/TTD026B","026","Full",25300,17.7,8,30400,5.7,8,28700,27.3,8,24800,5,8,26300,19.899999999999999,8,18900,4,8,"2-Stage","ECM - CA","2013-04-10"]
["ClimateMaster","TT 2-stage","TTV/TTH/TTD038C","038","Full",38000,17.8,9,45100,5.8,9,43300,27.1,9,37200,5.2,9,39900,20.3,9,29200,4.4000000000000004,9,"2-Stage","ECM - CA","2013-04-10"]
["ClimateMaster","TT 2-stage","TTV/TTH/TTD049B","049","Full",48700,17.3,12,59700,5.5,12,55800,26.1,12,48400,4.8,12,50800,19.3,12,37200,4,12,"2-Stage","ECM - CA","2013-04-10"]
["ClimateMaster","TT 2-stage","TTV/TTH/TTD064B","064","Full",61500,16.2,15,77400,5.4,15,71500,24.4,15,63200,4.8,15,66200,18.8,15,48700,3.9,15,"2-Stage","ECM - CA","2013-04-10"]
["ClimateMaster","TT 2-stage","TTV/TTH/TTD072B","072","Full",68300,15.1,17,85300,4.8,17,77700,22.5,17,71400,4.4000000000000004,17,71700,16.899999999999999,17,55800,3.7,17,"2-Stage","ECM - CA","2013-04-10"]
["ClimateMaster","TY 2-stage","TYV/TYH024B","024","Full",24100,14.6,6,28600,4.7,6,27000,22.1,6,23400,4.2,6,25100,16.399999999999999,6,18100,3.6,6,"2-Stage","ECM - CA","2013-04-10"]
["ClimateMaster","TY 2-stage","TYV/TYH030","030","Full",28500,14,8,35800,4.5999999999999996,8,32300,20.7,8,30000,4.2,8,29900,15.7,8,23800,3.6,8,"2-Stage","ECM - CA","2013-04-10"]
["ClimateMaster","TY 2-stage","TYV/TYH036B","036","Full",35000,15.5,9,43000,4.7,9,39000,23.1,9,35400,4.3,9,35600,17,9,27900,3.7,9,"2-Stage","ECM - CA","2013-04-10"]
["ClimateMaster","TY 2-stage","TYV/TYH042","042","Full",41100,14.3,10.5,50200,4.5999999999999996,10.5,46300,21.3,10.5,42300,4.0999999999999996,10.5,43100,16.100000000000001,10.5,33300,3.4,10.5,"2-Stage","ECM - CA","2013-04-10"]
["ClimateMaster","TY 2-stage","TYV/TYH048","048","Full",45900,14,12,53800,4.9000000000000004,12,51800,20.9,12,45000,4.4000000000000004,12,48100,15.5,12,35600,3.7,12,"2-Stage","ECM - CA","2013-04-10"]
["ClimateMaster","TY 2-stage","TYV/TYH060B","060","Full",61700,15.7,14,67500,4.8,14,68000,22.7,14,55400,4.3,14,63200,17.3,14,43700,3.6,14,"2-Stage","ECM - CA","2013-04-10"]
["ClimateMaster","TZ 2-stage","TZV/TZH024B","024","Full",24100,14.6,6,28600,4.7,6,27000,22.1,6,23400,4.2,6,25100,16.399999999999999,6,18100,3.6,6,"2-Stage","ECM - CA","2013-04-10"]
["ClimateMaster","TZ 2-stage","TZV/TZH030","030","Full",28500,14,8,35800,4.5999999999999996,8,32300,20.7,8,30000,4.2,8,29900,15.7,8,23800,3.6,8,"2-Stage","ECM - CA","2013-04-10"]
["ClimateMaster","TZ 2-stage","TZV/TZH036B","036","Full",35000,15.5,9,43000,4.7,9,39000,23.1,9,35400,4.3,9,35600,17,9,27900,3.7,9,"2-Stage","ECM - CA","2013-04-10"]
["ClimateMaster","TZ 2-stage","TZV/TZH042","042","Full",41100,14.3,10.5,50200,4.5999999999999996,10.5,46300,21.3,10.5,42300,4.0999999999999996,10.5,43100,16.100000000000001,10.5,33300,3.4,10.5,"2-Stage","ECM - CA","2013-04-10"]
["ClimateMaster","TZ 2-stage","TZV/TZH048","048","Full",45900,14,12,53800,4.9000000000000004,12,51800,20.9,12,45000,4.4000000000000004,12,48100,15.5,12,35600,3.7,12,"2-Stage","ECM - CA","2013-04-10"]
["ClimateMaster","TZ 2-stage","TZV/TZH060B","060","Full",61700,15.7,14,67500,4.8,14,68000,22.7,14,55400,4.3,14,63200,17.3,14,43700,3.6,14,"2-Stage","ECM - CA","2013-04-10"]
["Florida Heat Pump","CA","CA009-2","009","Full",8200,12.9,2,9400,4.5999999999999996,2,10200,22.3,2,7400,3.8,2,9000,16,2,5400,3.3,2,"1-Stage","PSC","2013-04-10"]
["Florida Heat Pump","CA","CA012-2","012","Full",10500,12,2.5,12400,4.3,2.5,13000,19.399999999999999,2.5,10900,3.8,2.5,11500,14.2,2.5,8400,3.3,2.5,"1-Stage","PSC","2013-04-10"]
["Florida Heat Pump","CA","CA015-2","015","Full",14400,13.3,4,15000,4.3,4,16400,19.8,4,11800,3.6,4,14700,14.5,4,9800,3.3,4,"1-Stage","PSC","2013-04-10"]
["Florida Heat Pump","CA","CA018-1","018","Full",16400,12.3,5,17500,4.2,5,18300,17.600000000000001,5,14600,3.4,5,17000,14,5,12000,3.1,5,"1-Stage","PSC","2013-04-10"]
["Florida Heat Pump","EC","EC007-2CF/HZ/VT","007","Full",6200,12.5,2,8000,5.0999999999999996,2,7200,20,2,6000,4,2,6500,15,2,4500,3.2,2,"1-Stage","PSC","2013-04-10"]
["Florida Heat Pump","EC","EC009-2CF/HZ/VT","009","Full",7800,13.7,2.5,11400,4.7,2.5,9000,20,2.5,8600,3.8,2.5,8100,14.8,2.5,6400,3.2,2.5,"1-Stage","PSC","2013-04-10"]
["Florida Heat Pump","EC","EC012-2CF/HZ/VT","012","Full",11000,13,3,14500,4.5,3,12400,19,3,11500,3.6,3,11500,14.5,3,8700,3.1,3,"1-Stage","PSC","2013-04-10"]
["Florida Heat Pump","EC","EC015-2CF/HZ/VT","015","Full",14000,13,4,18000,4.5999999999999996,4,15800,19,4,13500,3.8,4,14500,15,4,10100,3.3,4,"1-Stage","PSC","2013-04-10"]
["Florida Heat Pump","EC","EC018-2CF/HZ/VT","018","Full",18500,13,5,24000,4.4000000000000004,5,21400,19,5,18000,3.8,5,19800,14.1,5,13400,3.3,5,"1-Stage","PSC","2013-04-10"]
["Florida Heat Pump","EC","EC024-4CF/HZ/VT","024","Full",25000,13.8,6,30000,4.5,6,28200,20.6,6,23800,3.8,6,26500,15.2,6,17900,3.3,6,"1-Stage","PSC","2013-04-10"]
["Florida Heat Pump","EC","EC030-4CF/HZ/VT","030","Full",29000,13,7,35000,4.3,7,33000,18.600000000000001,7,28400,3.8,7,31000,14.4,7,21000,3.3,7,"1-Stage","PSC","2013-04-10"]
["Florida Heat Pump","EC","EC036-4CF/HZ/VT","036","Full",36000,13.8,9,46000,4.5,9,40200,19.5,9,36200,4,9,37800,15.5,9,27400,3.3,9,"1-Stage","PSC","2013-04-10"]
["Florida Heat Pump","EC","EC041-4CF/HZ/VT","041","Full",38000,12.5,9,49000,4.2,9,40400,16.100000000000001,9,39000,3.7,9,39200,14.1,9,28500,3.1,9,"1-Stage","PSC","2013-04-10"]
["Florida Heat Pump","EC","EC042-4CF/HZ/VT","042","Full",42000,13,10,53000,4.2,10,44500,18.5,10,42000,3.8,10,43800,14.2,10,32200,3.3,10,"1-Stage","PSC","2013-04-10"]
["Florida Heat Pump","EC","EC048-4CF/HZ/VT","048","Full",48000,14,12,58000,4.8,12,58000,20.6,12,46600,4.2,12,52000,15.4,12,36800,3.5,12,"1-Stage","PSC","2013-04-10"]
["Florida Heat Pump","EC","EC051-4CF/HZ/VT","051","Full",47500,13.8,12,53500,4.7,12,58000,20.6,12,46600,4.2,12,51000,15.5,12,37800,3.6,12,"1-Stage","PSC","2013-04-10"]
["Florida Heat Pump","EC","EC060-4CF/HZ/VT","060","Full",62000,13.2,15,79000,4.4000000000000004,15,67000,18.3,15,61500,3.9,15,63600,14.7,15,50000,3.3,15,"1-Stage","PSC","2013-04-10"]
["Florida Heat Pump","EC","EC061-4CF/HZ/VT","061","Full",59000,13.9,15,68000,4.5999999999999996,15,63000,19.7,15,55400,4.0999999999999996,15,61000,15.8,15,44600,3.5,15,"1-Stage","PSC","2013-04-10"]
["Florida Heat Pump","EC","EC070-4CF/HZ/VT","070","Full",68000,13.5,16,80000,4.5,16,76000,19.8,16,68000,4,16,70000,15.2,16,53000,3.3,16,"1-Stage","PSC","2013-04-10"]
["Florida Heat Pump","EC","EC072-4HZ/VT","072","Full",72000,13,16,92000,4.5,16,80400,18.600000000000001,16,72400,3.8,16,75600,14.2,16,54800,3.2,16,"1-Stage","Belt Drive","2013-04-10"]
["Florida Heat Pump","EC","EC096-4HZ/VT","096","Full",96000,14,21,116000,4.8,21,116000,20.6,21,93200,4.2,21,104000,15.4,21,73600,3.5,21,"1-Stage","Belt Drive","2013-04-10"]
["Florida Heat Pump","EC","EC120-4HZ/VT","120","Full",124000,13.2,28,158000,4.4000000000000004,28,134000,18.3,28,123000,3.9,28,127000,14.7,28,100000,3.2,28,"1-Stage","Belt Drive","2013-04-10"]
["Florida Heat Pump","EC","EC150-4HZ","150","Full",157000,16,35,181000,5.6,35,185000,24,35,140000,5,35,166000,17.899999999999999,35,107000,4.2,35,"1-Stage","Belt Drive","2013-04-10"]
["Florida Heat Pump","EC","EC151-4VT","151","Full",147000,16,35,181000,5.6,35,175000,24,35,140000,5,35,155000,17.899999999999999,35,107000,4.2,35,"1-Stage","Belt Drive","2013-04-10"]
["Florida Heat Pump","EC","EC180-4HZ","180","Full",182000,14.2,42,204000,5,42,195000,20,42,156000,4.2,42,185000,15.4,42,118000,3.5,42,"1-Stage","Belt Drive","2013-04-10"]
["Florida Heat Pump","EC","EC181-4VT","181","Full",170000,14.2,42,204000,5,42,185000,20,42,156000,4.2,42,175000,15.4,42,118000,3.5,42,"1-Stage","Belt Drive","2013-04-10"]
["Florida Heat Pump","EC","EC210-4VT","210","Full",220000,14.6,50,270000,5.0999999999999996,50,292000,22.5,50,204000,4.5,50,250000,17.2,50,152000,3.9,50,"1-Stage","Belt Drive","2013-04-10"]
["Florida Heat Pump","EC","EC240-4VT","240","Full",248000,14.4,60,315000,5,60,310000,21.1,60,250000,4.5,60,275000,16,60,180000,3.9,60,"1-Stage","Belt Drive","2013-04-10"]
["Florida Heat Pump","EC","EC242-4HZ","242","Full",248000,14.4,60,315000,5,60,310000,21.1,60,250000,4.5,60,275000,16,60,180000,3.9,60,"1-Stage","Belt Drive","2013-04-10"]
["Florida Heat Pump","EC","EC300-4VT","300","Full",295000,13,75,376000,4.2,75,365000,18.8,75,300000,3.8,75,318000,14,75,222000,3.2,75,"1-Stage","Belt Drive","2013-04-10"]
["Florida Heat Pump","EC","EC360-4VT","360","Full",386000,14.8,90,435000,4.4000000000000004,90,472000,22,90,342000,4,90,412000,16.399999999999999,90,252000,3.3,90,"1-Stage","Belt Drive","2013-04-10"]
["Florida Heat Pump","EP","EP015","015","Full",15200,17.5,4,17500,5.6,4,17000,28.8,4,13000,4.5999999999999996,4,16200,20.6,4,11000,3.9,4,"1-Stage","ECM - CA","2014-05-08"]
["Florida Heat Pump","EP","EP018","018","Full",19500,16.399999999999999,5,21300,5.3,5,21300,25.6,5,17700,4.5,5,20500,19,5,14800,3.8,5,"1-Stage","ECM - CA","2014-05-08"]
["Florida Heat Pump","EP","EP024","024","Full",24500,18.2,6,28500,5.7,6,28400,28.1,6,23700,4.5999999999999996,6,26000,21.1,6,18000,4,6,"1-Stage","ECM - CA","2014-05-08"]
["Florida Heat Pump","EP","EP030","030","Full",27000,16.600000000000001,7,31000,5.9,7,31700,27,7,25000,5.2,7,28500,19.399999999999999,7,20500,4.3,7,"1-Stage","ECM - CA","2014-05-08"]
["Florida Heat Pump","EP","EP036","036","Full",36000,17.2,10,41000,5.6,10,40200,25.9,10,34400,4.9000000000000004,10,37500,19.7,10,26000,4.0999999999999996,10,"1-Stage","ECM - CA","2014-05-08"]
["Florida Heat Pump","EP","EP042","042","Full",40600,18.2,10.5,42400,6,10.5,45000,25.7,10.5,35000,5.0999999999999996,10.5,42200,21.7,10.5,26800,4.0999999999999996,10.5,"1-Stage","ECM - CA","2014-05-08"]
["Florida Heat Pump","EP","EP048","048","Full",47400,17.2,12,50000,5.3,12,52900,26.1,12,40500,4.3,12,49500,20,12,33400,3.7,12,"1-Stage","ECM - CA","2014-05-08"]
["Florida Heat Pump","EP","EP060","060","Full",60400,16.2,15,71500,5.7,15,66500,24.1,15,56700,4.9000000000000004,15,61500,18.5,15,47000,4.2,15,"1-Stage","ECM - CA","2014-05-08"]
["Florida Heat Pump","EP","EP070","070","Full",68000,16.2,17,86000,5.6,17,71400,22.4,17,71400,5,17,70500,18.5,17,56500,4.2,17,"1-Stage","ECM - CA","2014-05-08"]
["Florida Heat Pump","EP","EP007","007","Full",6800,15.7,2,8800,5.7,2,8400,25.1,2,7000,4.9000000000000004,2,7400,18.5,2,5100,3.6,2,"1-Stage","PSC","2014-05-08"]
["Florida Heat Pump","EP","EP009","009","Full",9000,16.2,2.5,11200,5.5,2.5,10500,25.5,2.5,9000,4.5,2.5,9500,19.3,2.5,6800,3.6,2.5,"1-Stage","PSC","2014-05-08"]
["Florida Heat Pump","EP","EP012","012","Full",12200,14.9,4,16500,5.0999999999999996,4,114600,22.7,4,13000,4.3,4,13000,17.5,4,10000,3.6,4,"1-Stage","PSC","2014-05-08"]
["Florida Heat Pump","ES","ES018-2CF/HZ/VT","018","Full",19000,15.9,4,22500,5.2,4,20100,25.1,4,18000,4.5,4,19000,18.600000000000001,4,14500,3.7,4,"1-Stage","ECM - CA","2013-04-10"]
["Florida Heat Pump","ES","ES024-3CF/HZ/VT","024","Full",25000,14.2,5,32500,4.3,5,29500,21.9,5,26500,3.7,5,27000,15.9,5,20500,3.4,5,"1-Stage","ECM - CA","2013-04-10"]
["Florida Heat Pump","ES","ES024-4CF/HZ/VT","024","Full",24000,13.5,5,30500,4.5,5,27500,21.1,5,25500,4.0999999999999996,5,26000,16.100000000000001,5,20000,3.5,5,"1-Stage","ECM - CA","2013-04-10"]
["Florida Heat Pump","ES","ES030-4CF/HZ/VT","030","Full",30000,16,7.5,34500,5.2,7.5,33000,23.4,7.5,28500,4.5999999999999996,7.5,30500,18,7.5,22500,3.8,7.5,"1-Stage","ECM - CA","2013-04-10"]
["Florida Heat Pump","ES","ES036-4CF/HZ/VT","036","Full",34000,15.2,9,41500,5.3,9,38500,22.8,9,33500,4.5999999999999996,9,35500,17.600000000000001,9,26500,3.8,9,"1-Stage","ECM - CA","2013-04-10"]
["Florida Heat Pump","ES","ES042-4CF/HZ/VT","042","Full",43000,14.4,9,49000,4.8,9,48000,22,9,41000,4.2,9,45500,16.8,9,33500,3.6,9,"1-Stage","ECM - CA","2013-04-10"]
["Florida Heat Pump","ES","ES048-3CF/HZ/VT","048","Full",48500,13.85,12,56500,4.9000000000000004,12,54500,22,12,47500,4.4000000000000004,12,51000,17,12,38000,3.7,12,"1-Stage","ECM - CA","2013-04-10"]
["Florida Heat Pump","ES","ES060-3CF/HZ/VT","060","Full",61000,14,12,72000,4.8,12,69000,20.9,12,61500,4.4000000000000004,12,64000,16.3,12,50000,3.7,12,"1-Stage","ECM - CA","2013-04-10"]
["Florida Heat Pump","ES","ES070-3CF/HZ/VT","070","Full",68000,14,16,80000,4.5999999999999996,16,76000,20.3,16,68000,4.0999999999999996,16,70000,15.6,16,53000,3.3,16,"1-Stage","ECM - CA","2013-04-10"]
["Florida Heat Pump","ES 2-stage","ES025-1CF/HZ/VT","025","Full",26000,16,6,30000,5,6,29000,24,6,25000,4.5999999999999996,6,27500,18.7,6,19000,3.8,6,"2-Stage","ECM - CA","2013-04-10"]
["Florida Heat Pump","ES 2-stage","ES035-4CF/HZ/VT","035","Full",36000,14.6,9,43000,4.8,9,42000,21.6,9,36000,4.2,9,38000,17.2,9,28000,3.8,9,"2-Stage","ECM - CA","2013-04-10"]
["Florida Heat Pump","ES 2-stage","ES049-4CF/HZ/VT","049","Full",48000,12.6,12,58000,4.8,12,54000,19,12,48000,4.2,12,49000,15.5,12,38000,3.6,12,"2-Stage","ECM - CA","2013-04-10"]
["Florida Heat Pump","ES 2-stage","ES061-4CF/HZ/VT","061","Full",60000,14,14,72000,4.7,14,68000,19.7,14,61000,4.3,14,62000,15.7,14,49000,3.6,14,"2-Stage","ECM - CA","2013-04-10"]
["Florida Heat Pump","ES 2-stage","ES071-4CF/HZ/VT","071","Full",72000,14.5,18,80000,4.5,18,77000,19.600000000000001,18,68000,4.2,18,74000,16.3,18,53000,3.5,18,"2-Stage","ECM - CA","2013-04-10"]
["Florida Heat Pump","EV","EV030-4HZ","030","Full",30000,15.5,7.5,33500,4.7,7.5,34500,24,7.5,27500,4.0999999999999996,7.5,31000,18,7.5,22000,3.4,7.5,"1-Stage","PSC","2013-04-10"]
["Florida Heat Pump","EV","EV036-4HZ","036","Full",33000,14.8,9,39000,5,9,38500,22.6,9,31500,4.3,9,34000,17.399999999999999,9,24000,3.4,9,"1-Stage","PSC","2013-04-10"]
["Florida Heat Pump","EV","EV042-4HZ","042","Full",43000,13.5,9,47000,4.5999999999999996,9,47000,20,9,39000,4,9,44500,15.3,9,30500,3.3,9,"1-Stage","PSC","2013-04-10"]
["Florida Heat Pump","EV","EV048-4HZ","048","Full",48500,12.7,12,58000,4.8,12,55000,20.6,12,47000,4.2,12,49000,16.399999999999999,12,37500,3.4,12,"1-Stage","PSC","2013-04-10"]
["Florida Heat Pump","EV","EV060-4HZ/VT","060","Full",57500,13,12,66000,4.3,12,68000,19.2,12,56000,3.8,12,60000,15,12,45000,3.3,12,"1-Stage","PSC","2013-04-10"]
["Florida Heat Pump","LM 2-stage","LM024","024","Full",25500,17.399999999999999,6,29200,5.6,6,29000,26.5,6,23500,4.9000000000000004,6,26600,19.899999999999999,6,18000,4.0999999999999996,6,"2-Stage","ECM - CA","2014-04-15"]
["Florida Heat Pump","LM 2-stage","LM036","036","Full",39000,19,9,42800,5.6,9,43300,28,9,35900,5.0999999999999996,9,40800,22,9,28400,4.3,9,"2-Stage","ECM - CA","2014-04-15"]
["Florida Heat Pump","LM 2-stage","LM048","048","Full",49200,16.600000000000001,12,56100,5.3,12,55300,25.3,12,46300,4.7,12,51300,19.3,12,36900,4,12,"2-Stage","ECM - CA","2014-04-15"]
["Florida Heat Pump","LM 2-stage","LM060","060","Full",63800,17,15,73300,5.2,15,70200,24.4,15,60300,4.5999999999999996,15,65100,18.899999999999999,15,48000,3.9,15,"2-Stage","ECM - CA","2014-04-15"]
["Florida Heat Pump","LM 2-stage","LM070","070","Full",71600,16.3,18,84000,5.0999999999999996,18,78700,23.1,18,70000,4.5,18,73700,18.5,18,55300,3.8,18,"2-Stage","ECM - CA","2014-04-15"]
["Florida Heat Pump","LV","LV015-1VT/CF/HZ*-***A","015","Full",13700,14,4,15500,4.4000000000000004,4,null,null,null,null,null,null,14400,16.2,4,10700,3.3,4,"1-Stage","ECM - CA","2013-04-10"]
["Florida Heat Pump","LV","LV018-1VT/CF/HZ*-***A","018","Full",19700,14.2,5,21900,4.7,5,null,null,null,null,null,null,21500,17,5,14100,3.6,5,"1-Stage","ECM - CA","2013-04-10"]
["Florida Heat Pump","LV","LV024-1VT/CF/HZ*-***A","024","Full",23800,14.3,6,26200,4.5999999999999996,6,null,null,null,null,null,null,25400,16.5,6,16700,3.5,6,"1-Stage","ECM - CA","2013-04-10"]
["Florida Heat Pump","LV","LV030-1VT/CF/HZ*-***A","030","Full",30000,14.8,7,32800,4.5999999999999996,7,null,null,null,null,null,null,31600,17.399999999999999,7,20400,3.4,7,"1-Stage","ECM - CA","2013-04-10"]
["Florida Heat Pump","LV","LV036-1VT/CF/HZ*-***A","036","Full",38200,15.4,9,41400,4.7,9,null,null,null,null,null,null,40200,17.7,9,26500,3.6,9,"1-Stage","ECM - CA","2013-04-10"]
["Florida Heat Pump","LV","LV041-1VT/CF*-***A","041","Full",40500,15.7,9,43700,4.4000000000000004,9,null,null,null,null,null,null,42200,17.7,9,28500,3.6,9,"1-Stage","ECM - CA","2013-04-10"]
["Florida Heat Pump","LV","LV042-1VT/CF/HZ*-***A","042","Full",40900,14.1,10,45300,4.4000000000000004,10,null,null,null,null,null,null,43500,16.3,10,30100,3.5,10,"1-Stage","ECM - CA","2013-04-10"]
["Florida Heat Pump","LV","LV048-1VT/HF/HZ*-***A","048","Full",46800,14.1,12,55600,4.5,12,null,null,null,null,null,null,49600,16.2,12,34600,3.6,12,"1-Stage","ECM - CA","2013-04-10"]
["Florida Heat Pump","LV","LV060-1VT/CF/HZ*-***A","060","Full",59000,14.1,15,66400,4.2,15,null,null,null,null,null,null,61100,16.399999999999999,15,46200,3.3,15,"1-Stage","ECM - CA","2013-04-10"]
["Florida Heat Pump","LV","LV070-1VT/CF/HZ*-***A","070","Full",65200,14.6,16,71800,4.5999999999999996,16,null,null,null,null,null,null,67600,16.600000000000001,16,50000,3.5,16,"1-Stage","ECM - CA","2013-04-10"]
["Florida Heat Pump","LV","LV007-1VT/CF/HZ*-***P","007","Full",6100,12.2,2,7800,5.3,2,null,null,null,null,null,null,6800,15.1,2,4900,3.4,2,"1-Stage","PSC","2013-04-10"]
["Florida Heat Pump","LV","LV009-1VT/CF/HZ*-***P","009","Full",8200,12.4,2.5,9900,4.7,2.5,null,null,null,null,null,null,8700,14.6,2.5,5700,3.2,2.5,"1-Stage","PSC","2013-04-10"]
["Florida Heat Pump","LV","LV012-1VT/CF/HZ*-***P","012","Full",10900,11.8,3,13000,4.3,3,null,null,null,null,null,null,11800,14,3,8700,3.1,3,"1-Stage","PSC","2013-04-10"]
["Florida Heat Pump","LV","LV015-1VT/CF/HZ*-***P","015","Full",13400,12.1,4,16100,4.2,4,null,null,null,null,null,null,14200,14,4,11300,3.1,4,"1-Stage","PSC","2013-04-10"]
["Florida Heat Pump","LV","LV018-1VT/CF/HZ*-***P","018","Full",19400,13.4,5,22200,4.5999999999999996,5,null,null,null,null,null,null,21200,15.8,5,14300,3.5,5,"1-Stage","PSC","2013-04-10"]
["Florida Heat Pump","LV","LV024-1VT/CF/HZ*-***P","024","Full",23400,13.4,6,26600,4.4000000000000004,6,null,null,null,null,null,null,25000,15.5,6,17000,3.4,6,"1-Stage","PSC","2013-04-10"]
["Florida Heat Pump","LV","LV030-1VT/CF/HZ*-***P","030","Full",29200,13.1,7,33400,4.3,7,null,null,null,null,null,null,31000,15.3,7,20900,3.2,7,"1-Stage","PSC","2013-04-10"]
["Florida Heat Pump","LV","LV036-1VT/CF/HZ*-***P","036","Full",37900,14.7,9,41800,4.5999999999999996,9,null,null,null,null,null,null,39900,16.899999999999999,9,26900,3.5,9,"1-Stage","PSC","2013-04-10"]
["Florida Heat Pump","LV","LV041-1VT/CF*-***P","041","Full",39500,13.6,9,44600,4.2,9,null,null,null,null,null,null,41200,15.6,9,29400,3.3,9,"1-Stage","PSC","2013-04-10"]
["Florida Heat Pump","LV","LV042-1VT/CF/HZ*-***P","042","Full",40000,12.6,10,46300,4.2,10,null,null,null,null,null,null,42600,14.5,10,31000,3.2,10,"1-Stage","PSC","2013-04-10"]
["Florida Heat Pump","LV","LV048-1VT/HF/HZ*-***P","048","Full",45900,12.9,12,56400,4.3,12,null,null,null,null,null,null,48800,14.9,12,35400,3.4,12,"1-Stage","PSC","2013-04-10"]
["Florida Heat Pump","LV","LV060-1VT/CF/HZ*-***P","060","Full",57900,13.2,15,67200,4.2,15,null,null,null,null,null,null,60100,15,15,46900,3.2,15,"1-Stage","PSC","2013-04-10"]
["Florida Heat Pump","LV","LV070-1VT/CF/HZ*-***P","070","Full",64000,13.3,16,72800,4.4000000000000004,16,null,null,null,null,null,null,66400,15,16,50800,3.4,16,"1-Stage","PSC","2013-04-10"]
["Florida Heat Pump","MC","MC360",360,"Full",391200,18.600000000000001,90,386900,5.5,90,0,0,0,0,0,0,0,0,0,0,0,0,"1-Stage","Belt Drive","2014-04-15"]
["Florida Heat Pump","MC","MC480",480,"Full",500000,19,120,623000,5.4,120,0,0,0,0,0,0,0,0,0,0,0,0,"1-Stage","Belt Drive","2014-04-15"]
["Florida Heat Pump","MC","MC600",600,"Full",637200,19,150,731800,5.4,150,0,0,0,0,0,0,0,0,0,0,0,0,"1-Stage","Belt Drive","2014-04-15"]
["Florida Heat Pump","MC","MC720",720,"Full",783600,18.600000000000001,180,773800,5.5,180,0,0,0,0,0,0,0,0,0,0,0,0,"1-Stage","Belt Drive","2014-04-15"]
["Florida Heat Pump","TRS","TRS036","036","Full",38090,14.4,7.5,46211,5.17,7.5,0,0,0,0,0,0,39752,16.399999999999999,7.5,29231,3.61,7.5,"1-Stage","Belt Drive","2013-04-10"]
["Florida Heat Pump","TRS","TRS048","048","Full",52095,15.4,10,61121,5.19,10,0,0,0,0,0,0,54352,17.8,10,39327,3.79,10,"1-Stage","Belt Drive","2013-04-10"]
["Florida Heat Pump","TRS","TRS066","066","Full",70075,15,12.5,81384,4.8499999999999996,12.5,0,0,0,0,0,0,72901,16.75,12.5,51538,3.39,12.5,"1-Stage","Belt Drive","2013-04-10"]
["Florida Heat Pump","TRS","TRS072","072","Full",75224,13.5,15,94842,5.13,15,0,0,0,0,0,0,78308,15.2,15,60250,3.64,15,"1-Stage","Belt Drive","2013-04-10"]
["Florida Heat Pump","TRS","TRS084","084","Full",85534,12.6,17.5,110539,4.9000000000000004,17.5,0,0,0,0,0,0,88826,14.1,17.5,70261,3.7,17.5,"1-Stage","Belt Drive","2013-04-10"]
["Florida Heat Pump","TRS","TRS096","096","Full",109084,14.4,20,128592,5.2,20,0,0,0,0,0,0,113778,16.3,20,82078,3.86,20,"1-Stage","Belt Drive","2013-04-10"]
["Florida Heat Pump","TRS","TRS120","120","Full",142372,15.2,25,164834,5.19,25,0,0,0,0,0,0,148344,17,25,105706,3.63,25,"1-Stage","Belt Drive","2013-04-10"]
["Florida Heat Pump","TRS","TRS150","150","Full",164390,14.9,31.25,198666,5.29,31.25,0,0,0,0,0,0,171048,16.809999999999999,31.25,128646,3.82,31.25,"1-Stage","Belt Drive","2013-04-10"]
["Florida Heat Pump","TRS","TRS180","180","Full",199072,14.9,37.5,241608,5.18,37.5,0,0,0,0,0,0,206992,16.7,37.5,155900,3.95,37.5,"1-Stage","Belt Drive","2013-04-10"]
["Florida Heat Pump","TRS","TRS200",200,"Full",225066,15.8,41.7,264276,5.31,41.7,0,0,0,0,0,0,234082,17.7,41.7,167404,3.95,41.7,"1-Stage","Belt Drive","2013-04-10"]
["Florida Heat Pump","TRS","TRS210","210","Full",222472,15.3,43.8,265856,5.5,43.8,0,0,0,0,0,0,231598,17.2,43.8,167484,4.03,43.8,"1-Stage","Belt Drive","2013-04-10"]
["Florida Heat Pump","TRS","TRS240","240","Full",263654,16.399999999999999,50,298834,5.61,50,0,0,0,0,0,0,274346,18.5,50,190026,4.18,50,"1-Stage","Belt Drive","2013-04-10"]
["Florida Heat Pump","TRS","TRS300","300","Full",358174,13.9,62.5,439652,4.9000000000000004,62.5,0,0,0,0,0,0,372950,15.59,62.5,285872,3.77,62.5,"1-Stage","Belt Drive","2013-04-10"]
["Florida Heat Pump","TRS","TRS360","360","Full",414688,14.3,75,497222,4.92,75,0,0,0,0,0,0,430604,15.9,75,315926,3.69,75,"1-Stage","Belt Drive","2013-04-10"]
["Florida Heat Pump","TRS","TRS420","420","Full",477606,14.7,87.6,583648,4.9800000000000004,87.6,0,0,0,0,0,0,496578,16.5,75,373286,3.82,75,"1-Stage","Belt Drive","2013-04-10"]
["Florida Heat Pump","WW","WW024-1","024","Full",23900,12.8,6,35000,4.3,6,26500,20,6,29000,3.6,6,25000,14.9,6,23500,3,6,"1-Stage","NA","2013-04-10"]
["Florida Heat Pump","WW","WW036-3","036","Full",25500,13.3,9,37000,4.4000000000000004,9,28500,20.9,9,30000,3.7,9,26500,15.5,9,24500,3,9,"1-Stage","NA","2013-04-10"]
["Florida Heat Pump","WW","WW048-3","048","Full",39300,12.8,12,57000,4.3,12,44000,19.899999999999999,12,47000,3.6,12,41000,14.8,12,38500,2.9,12,"1-Stage","NA","2013-04-10"]
["Florida Heat Pump","WW","WW060-3","060","Full",51300,12.7,15,75500,4.4000000000000004,15,56000,19.2,15,62000,3.6,15,53000,14.6,15,50500,3,15,"1-Stage","NA","2013-04-10"]
["Florida Heat Pump","WW","WW072-3","072","Full",55100,13.2,15,80000,4.4000000000000004,15,61000,20.399999999999999,15,65000,3.6,15,57500,15.3,15,52000,2.9,15,"1-Stage","NA","2013-04-10"]
["Florida Heat Pump","WW","WW120-4CS/US","120","Full",110100,13.5,30,160000,4.4000000000000004,30,125000,19.2,30,129000,3.7,30,116000,15.5,30,103500,3,30,"1-Stage","NA","2013-04-10"]
["Florida Heat Pump","WW","WW122-4CS/US","122","Full",114000,13.8,30,160800,4.5999999999999996,30,130000,21.3,30,129500,3.8,30,119500,16.100000000000001,30,102500,3,30,"1-Stage","NA","2013-04-10"]
["Florida Heat Pump","WW","WW180","180","Full",127000,13.8,"NDA",180500,4.5,"NDA",143000,20.7,"NDA",148500,3.8,"NDA",132500,15.9,"NDA",121000,3.2,"NDA","1-Stage","NA","2013-04-10"]
["Florida Heat Pump","WW","WW210","210","Full",164200,13.2,"NDA",239500,4.4000000000000004,"NDA",185500,19.100000000000001,"NDA",194000,3.7,"NDA",171500,15.1,"NDA",1056000,3,"NDA","1-Stage","NA","2013-04-10"]
["Florida Heat Pump","WW","WW240","240","Full",222000,13.5,"NDA",320000,4.4000000000000004,"NDA",249500,19.2,"NDA",258500,3.7,"NDA",232500,15.5,"NDA",206500,3,"NDA","1-Stage","NA","2013-04-10"]
["Florida Heat Pump","WW","WW360","360","Full",254000,13.8,"NDA",361500,4.5,"NDA",286500,20.7,"NDA",297000,3.8,"NDA",265000,15.9,"NDA",242000,3.2,"NDA","1-Stage","NA","2013-04-10"]
["Florida Heat Pump","WW","WW420","420","Full",328300,13.2,"NDA",479000,4.4000000000000004,"NDA",370500,19.100000000000001,"NDA",387500,3.7,"NDA",343000,15.1,"NDA",312000,3,"NDA","1-Stage","NA","2013-04-10"]
["Generic WSHP","10 EER WSHP","1/2-ton 10 EER WSHP","006","Full",6000,10,1.5,7500,3.5,1.5,0.04,null,null,null,null,null,null,null,null,null,null,null,"1-Stage"]
["Generic WSHP","10 EER WSHP","3/4-ton 10 EER WSHP","009","Full",9000,10,2.25,11250,3.5,2.25,0.05,null,null,null,null,null,null,null,null,null,null,null,"1-Stage"]
["Generic WSHP","10 EER WSHP","1-ton 10 EER WSHP","012","Full",12000,10,3,15000,3.5,3,0.125,null,null,null,null,null,null,null,null,null,null,null,"1-Stage"]
["Generic WSHP","10 EER WSHP","1.25-ton 10 EER WSHP","015","Full",15000,10,3.75,18750,3.5,3.75,0.16666666666666666,null,null,null,null,null,null,null,null,null,null,null,"1-Stage"]
["Generic WSHP","10 EER WSHP","1.5-ton 10 EER WSHP","018","Full",18000,10,4.5,22500,3.5,4.5,0.16666666666666666,null,null,null,null,null,null,null,null,null,null,null,"1-Stage"]
["Generic WSHP","10 EER WSHP","2-ton 10 EER WSHP","024","Full",24000,10,6,30000,3.5,6,0.2,null,null,null,null,null,null,null,null,null,null,null,"1-Stage"]
["Generic WSHP","10 EER WSHP","2.5-ton 10 EER WSHP","030","Full",30000,10,7.5,37500,3.5,7.5,0.33333333333333331,null,null,null,null,null,null,null,null,null,null,null,"1-Stage"]
["Generic WSHP","10 EER WSHP","3-ton 10 EER WSHP","036","Full",36000,10,9,45000,3.5,9,0.5,null,null,null,null,null,null,null,null,null,null,null,"1-Stage"]
["Generic WSHP","10 EER WSHP","3.5-ton 10 EER WSHP","042","Full",42000,10,10.5,52500,3.5,10.5,0.5,null,null,null,null,null,null,null,null,null,null,null,"1-Stage"]
["Generic WSHP","10 EER WSHP","4-ton 10 EER WSHP","048","Full",48000,10,12,60000,3.5,12,0.75,null,null,null,null,null,null,null,null,null,null,null,"1-Stage"]
["Generic WSHP","10 EER WSHP","5-ton 10 EER WSHP","060","Full",60000,10,15,75000,3.5,15,1,null,null,null,null,null,null,null,null,null,null,null,"1-Stage"]
["Generic WSHP","10 EER WSHP","6-ton 10 EER WSHP","070","Full",70000,10,18,87500,3.5,18,1,null,null,null,null,null,null,null,null,null,null,null,"1-Stage"]
["Generic WSHP","10 EER WSHP","7-ton 10 EER WSHP","084","Full",84000,10,21,105000,3.5,21,1,null,null,null,null,null,null,null,null,null,null,null,"1-Stage"]
["Generic WSHP","10 EER WSHP","10-ton 10 EER WSHP",120,"Full",120000,10,30,150000,3.5,30,3,null,null,null,null,null,null,null,null,null,null,null,"1-Stage"]
["Generic WSHP","10 EER WSHP","12.5-ton 10 EER WSHP",144,"Full",144000,10,37.5,180000,3.5,37.5,3,null,null,null,null,null,null,null,null,null,null,null,"1-Stage"]
["Generic WSHP","10 EER WSHP","14-ton 10 EER WSHP",168,"Full",168000,10,42,210000,3.5,42,3,null,null,null,null,null,null,null,null,null,null,null,"1-Stage"]
["Generic WSHP","10 EER WSHP","15-ton 10 EER WSHP",180,"Full",180000,10,45,225000,3.5,45,3,null,null,null,null,null,null,null,null,null,null,null,"1-Stage"]
["Generic WSHP","10 EER WSHP","17.5-ton 10 EER WSHP",210,"Full",210000,10,52.5,262500,3.5,52.5,5,null,null,null,null,null,null,null,null,null,null,null,"1-Stage"]
["Generic WSHP","10 EER WSHP","20-ton 10 EER WSHP",240,"Full",240000,10,60,300000,3.5,60,5,null,null,null,null,null,null,null,null,null,null,null,"1-Stage"]
["Generic WSHP","10 EER WSHP","25-ton 10 EER WSHP",300,"Full",300000,10,75,375000,3.5,75,7.5,null,null,null,null,null,null,null,null,null,null,null,"1-Stage"]
["Generic WSHP","10 EER WSHP","30-ton 10 EER WSHP",360,"Full",360000,10,90,450000,3.5,90,7.5,null,null,null,null,null,null,null,null,null,null,null,"1-Stage"]
["Generic WSHP","12 EER WSHP","1/2-ton 12 EER WSHP","006","Full",6000,12,1.5,7500,3.5,1.5,0.04,null,null,null,null,null,null,null,null,null,null,null,"1-Stage"]
["Generic WSHP","12 EER WSHP","3/4-ton 12 EER WSHP","009","Full",9000,12,2.25,11250,3.5,2.25,0.05,null,null,null,null,null,null,null,null,null,null,null,"1-Stage"]
["Generic WSHP","12 EER WSHP","1-ton 12 EER WSHP","012","Full",12000,12,3,15000,3.5,3,0.125,null,null,null,null,null,null,null,null,null,null,null,"1-Stage"]
["Generic WSHP","12 EER WSHP","1.25-ton 12 EER WSHP","015","Full",15000,12,3.75,18750,3.5,3.75,0.16666666666666666,null,null,null,null,null,null,null,null,null,null,null,"1-Stage"]
["Generic WSHP","12 EER WSHP","1.5-ton 12 EER WSHP","018","Full",18000,12,4.5,22500,3.5,4.5,0.16666666666666666,null,null,null,null,null,null,null,null,null,null,null,"1-Stage"]
["Generic WSHP","12 EER WSHP","2-ton 12 EER WSHP","024","Full",24000,12,6,30000,3.5,6,0.2,null,null,null,null,null,null,null,null,null,null,null,"1-Stage"]
["Generic WSHP","12 EER WSHP","2.5-ton 12 EER WSHP","030","Full",30000,12,7.5,37500,3.5,7.5,0.33333333333333331,null,null,null,null,null,null,null,null,null,null,null,"1-Stage"]
["Generic WSHP","12 EER WSHP","3-ton 12 EER WSHP","036","Full",36000,12,9,45000,3.5,9,0.5,null,null,null,null,null,null,null,null,null,null,null,"1-Stage"]
["Generic WSHP","12 EER WSHP","3.5-ton 12 EER WSHP","042","Full",42000,12,10.5,52500,3.5,10.5,0.5,null,null,null,null,null,null,null,null,null,null,null,"1-Stage"]
["Generic WSHP","12 EER WSHP","4-ton 12 EER WSHP","048","Full",48000,12,12,60000,3.5,12,0.75,null,null,null,null,null,null,null,null,null,null,null,"1-Stage"]
["Generic WSHP","12 EER WSHP","5-ton 12 EER WSHP","060","Full",60000,12,15,75000,3.5,15,1,null,null,null,null,null,null,null,null,null,null,null,"1-Stage"]
["Generic WSHP","12 EER WSHP","6-ton 12 EER WSHP","070","Full",70000,12,18,87500,3.5,18,1,null,null,null,null,null,null,null,null,null,null,null,"1-Stage"]
["Generic WSHP","12 EER WSHP","7-ton 12 EER WSHP","084","Full",84000,12,21,105000,3.5,21,1,null,null,null,null,null,null,null,null,null,null,null,"1-Stage"]
["Generic WSHP","12 EER WSHP","10-ton 12 EER WSHP",120,"Full",120000,12,30,150000,3.5,30,3,null,null,null,null,null,null,null,null,null,null,null,"1-Stage"]
["Generic WSHP","12 EER WSHP","12.5-ton 12 EER WSHP",144,"Full",144000,12,37.5,180000,3.5,37.5,3,null,null,null,null,null,null,null,null,null,null,null,"1-Stage"]
["Generic WSHP","12 EER WSHP","14-ton 12 EER WSHP",168,"Full",168000,12,42,210000,3.5,42,3,null,null,null,null,null,null,null,null,null,null,null,"1-Stage"]
["Generic WSHP","12 EER WSHP","15-ton 12 EER WSHP",180,"Full",180000,12,45,225000,3.5,45,3,null,null,null,null,null,null,null,null,null,null,null,"1-Stage"]
["Generic WSHP","12 EER WSHP","17.5-ton 12 EER WSHP",210,"Full",210000,12,52.5,262500,3.5,52.5,5,null,null,null,null,null,null,null,null,null,null,null,"1-Stage"]
["Generic WSHP","12 EER WSHP","20-ton 12 EER WSHP",240,"Full",240000,12,60,300000,3.5,60,5,null,null,null,null,null,null,null,null,null,null,null,"1-Stage"]
["Generic WSHP","12 EER WSHP","25-ton 12 EER WSHP",300,"Full",300000,12,75,375000,3.5,75,7.5,null,null,null,null,null,null,null,null,null,null,null,"1-Stage"]
["Generic WSHP","12 EER WSHP","30-ton 12 EER WSHP",360,"Full",360000,12,90,450000,3.5,90,7.5,null,null,null,null,null,null,null,null,null,null,null,"1-Stage"]
["Generic Air Source","10 EER Air Source","1/2-ton 10 EER Air","006","Full",6000,10,1.5,7500,80,1.5,0.04,null,null,null,null,null,null,null,null,null,null,null,"1-Stage"]
["Generic Air Source","10 EER Air Source","3/4-ton 10 EER Air","009","Full",9000,10,2.25,11250,80,2.25,0.05,null,null,null,null,null,null,null,null,null,null,null,"1-Stage"]
["Generic Air Source","10 EER Air Source","1-ton 10 EER Air","012","Full",12000,10,3,15000,80,3,0.125,null,null,null,null,null,null,null,null,null,null,null,"1-Stage"]
["Generic Air Source","10 EER Air Source","1.25-ton 10 EER Air","015","Full",15000,10,3.75,18750,80,3.75,0.16666666666666666,null,null,null,null,null,null,null,null,null,null,null,"1-Stage"]
["Generic Air Source","10 EER Air Source","1.5-ton 10 EER Air","018","Full",18000,10,4.5,22500,80,4.5,0.16666666666666666,null,null,null,null,null,null,null,null,null,null,null,"1-Stage"]
["Generic Air Source","10 EER Air Source","2-ton 10 EER Air","024","Full",24000,10,6,30000,80,6,0.2,null,null,null,null,null,null,null,null,null,null,null,"1-Stage"]
["Generic Air Source","10 EER Air Source","2.5-ton 10 EER Air","030","Full",30000,10,7.5,37500,80,7.5,0.33333333333333331,null,null,null,null,null,null,null,null,null,null,null,"1-Stage"]
["Generic Air Source","10 EER Air Source","3-ton 10 EER Air","036","Full",36000,10,9,45000,80,9,0.5,null,null,null,null,null,null,null,null,null,null,null,"1-Stage"]
["Generic Air Source","10 EER Air Source","3.5-ton 10 EER Air","042","Full",42000,10,10.5,52500,80,10.5,0.5,null,null,null,null,null,null,null,null,null,null,null,"1-Stage"]
["Generic Air Source","10 EER Air Source","4-ton 10 EER Air","048","Full",48000,10,12,60000,80,12,0.75,null,null,null,null,null,null,null,null,null,null,null,"1-Stage"]
["Generic Air Source","10 EER Air Source","5-ton 10 EER Air","060","Full",60000,10,15,75000,80,15,1,null,null,null,null,null,null,null,null,null,null,null,"1-Stage"]
["Generic Air Source","10 EER Air Source","6-ton 10 EER Air","070","Full",70000,10,18,87500,80,18,1,null,null,null,null,null,null,null,null,null,null,null,"1-Stage"]
["Generic Air Source","10 EER Air Source","7-ton 10 EER Air","084","Full",84000,10,21,105000,80,21,1,null,null,null,null,null,null,null,null,null,null,null,"1-Stage"]
["Generic Air Source","10 EER Air Source","10-ton 10 EER Air",120,"Full",120000,10,30,150000,80,30,3,null,null,null,null,null,null,null,null,null,null,null,"1-Stage"]
["Generic Air Source","10 EER Air Source","12.5-ton 10 EER Air",144,"Full",144000,10,37.5,180000,80,37.5,3,null,null,null,null,null,null,null,null,null,null,null,"1-Stage"]
["Generic Air Source","10 EER Air Source","14-ton 10 EER Air",168,"Full",168000,10,42,210000,80,42,3,null,null,null,null,null,null,null,null,null,null,null,"1-Stage"]
["Generic Air Source","10 EER Air Source","15-ton 10 EER Air",180,"Full",180000,10,45,225000,80,45,3,null,null,null,null,null,null,null,null,null,null,null,"1-Stage"]
["Generic Air Source","10 EER Air Source","17.5-ton 10 EER Air",210,"Full",210000,10,52.5,262500,80,52.5,5,null,null,null,null,null,null,null,null,null,null,null,"1-Stage"]
["Generic Air Source","10 EER Air Source","20-ton 10 EER Air",240,"Full",240000,10,60,300000,80,60,5,null,null,null,null,null,null,null,null,null,null,null,"1-Stage"]
["Generic Air Source","10 EER Air Source","25-ton 10 EER Air",300,"Full",300000,10,75,375000,80,75,7.5,null,null,null,null,null,null,null,null,null,null,null,"1-Stage"]
["Generic Air Source","10 EER Air Source","30-ton 10 EER Air",360,"Full",360000,10,90,450000,80,90,7.5,null,null,null,null,null,null,null,null,null,null,null,"1-Stage"]
["Generic Air Source","12 EER Air Source","1/2-ton 12 EER Air","006","Full",6000,12,1.5,7500,80,1.5,0.04,null,null,null,null,null,null,null,null,null,null,null,"1-Stage"]
["Generic Air Source","12 EER Air Source","3/4-ton 12 EER Air","009","Full",9000,12,2.25,11250,80,2.25,0.05,null,null,null,null,null,null,null,null,null,null,null,"1-Stage"]
["Generic Air Source","12 EER Air Source","1-ton 12 EER Air","012","Full",12000,12,3,15000,80,3,0.125,null,null,null,null,null,null,null,null,null,null,null,"1-Stage"]
["Generic Air Source","12 EER Air Source","1.25-ton 12 EER Air","015","Full",15000,12,3.75,18750,80,3.75,0.16666666666666666,null,null,null,null,null,null,null,null,null,null,null,"1-Stage"]
["Generic Air Source","12 EER Air Source","1.5-ton 12 EER Air","018","Full",18000,12,4.5,22500,80,4.5,0.16666666666666666,null,null,null,null,null,null,null,null,null,null,null,"1-Stage"]
["Generic Air Source","12 EER Air Source","2-ton 12 EER Air","024","Full",24000,12,6,30000,80,6,0.2,null,null,null,null,null,null,null,null,null,null,null,"1-Stage"]
["Generic Air Source","12 EER Air Source","2.5-ton 12 EER Air","030","Full",30000,12,7.5,37500,80,7.5,0.33333333333333331,null,null,null,null,null,null,null,null,null,null,null,"1-Stage"]
["Generic Air Source","12 EER Air Source","3-ton 12 EER Air","036","Full",36000,12,9,45000,80,9,0.5,null,null,null,null,null,null,null,null,null,null,null,"1-Stage"]
["Generic Air Source","12 EER Air Source","3.5-ton 12 EER Air","042","Full",42000,12,10.5,52500,80,10.5,0.5,null,null,null,null,null,null,null,null,null,null,null,"1-Stage"]
["Generic Air Source","12 EER Air Source","4-ton 12 EER Air","048","Full",48000,12,12,60000,80,12,0.75,null,null,null,null,null,null,null,null,null,null,null,"1-Stage"]
["Generic Air Source","12 EER Air Source","5-ton 12 EER Air","060","Full",60000,12,15,75000,80,15,1,null,null,null,null,null,null,null,null,null,null,null,"1-Stage"]
["Generic Air Source","12 EER Air Source","6-ton 12 EER Air","070","Full",70000,12,18,87500,80,18,1,null,null,null,null,null,null,null,null,null,null,null,"1-Stage"]
["Generic Air Source","12 EER Air Source","7-ton 12 EER Air","084","Full",84000,12,21,105000,80,21,1,null,null,null,null,null,null,null,null,null,null,null,"1-Stage"]
["Generic Air Source","12 EER Air Source","10-ton 12 EER Air",120,"Full",120000,12,30,150000,80,30,3,null,null,null,null,null,null,null,null,null,null,null,"1-Stage"]
["Generic Air Source","12 EER Air Source","12.5-ton 12 EER Air",144,"Full",144000,12,37.5,180000,80,37.5,3,null,null,null,null,null,null,null,null,null,null,null,"1-Stage"]
["Generic Air Source","12 EER Air Source","14-ton 12 EER Air",168,"Full",168000,12,42,210000,80,42,3,null,null,null,null,null,null,null,null,null,null,null,"1-Stage"]
["Generic Air Source","12 EER Air Source","15-ton 12 EER Air",180,"Full",180000,12,45,225000,80,45,3,null,null,null,null,null,null,null,null,null,null,null,"1-Stage"]
["Generic Air Source","12 EER Air Source","17.5-ton 12 EER Air",210,"Full",210000,12,52.5,262500,80,52.5,5,null,null,null,null,null,null,null,null,null,null,null,"1-Stage"]
["Generic Air Source","12 EER Air Source","20-ton 12 EER Air",240,"Full",240000,12,60,300000,80,60,5,null,null,null,null,null,null,null,null,null,null,null,"1-Stage"]
["Generic Air Source","12 EER Air Source","25-ton 12 EER Air",300,"Full",300000,12,75,375000,80,75,7.5,null,null,null,null,null,null,null,null,null,null,null,"1-Stage"]
["Generic Air Source","12 EER Air Source","30-ton 12 EER Air",360,"Full",360000,12,90,450000,80,90,7.5,null,null,null,null,null,null,null,null,null,null,null,"1-Stage"]
["Johnson Controls","RBS","RBSV/RBSH015**2*4","015","Full",13800,13.2,4,16100,4.5999999999999996,4,16000,21,4,13400,4.0999999999999996,4,14200,15.7,4,11000,3.3,4,"1-Stage","ECM - 5-speed","2013-04-10"]
["Johnson Controls","RBS","RBSV/RBSH018**2*4","018","Full",17300,14.2,5,19000,4.5,5,19800,22,5,16000,3.9,5,18000,16.2,5,12600,3.3,5,"1-Stage","ECM - 5-speed","2013-04-10"]
["Johnson Controls","RBS","RBSV/RBSH024**4*4","024","Full",22900,13.6,6,26000,4.7,6,27000,20.8,6,22600,4.2,6,24500,15.6,6,17000,3.5,6,"1-Stage","ECM - 5-speed","2013-04-10"]
["Johnson Controls","RBS","RBSV/RBSH030**4*4","030","Full",28400,14.7,8,34000,4.7,8,33500,22.5,8,28000,4.2,8,30000,17,8,21000,3.5,8,"1-Stage","ECM - 5-speed","2013-04-10"]
["Johnson Controls","RBS","RBSV/RBSH036**4*4","036","Full",34500,14.5,9,43800,4.9000000000000004,9,40000,23,9,35600,4.4000000000000004,9,36000,17,9,26000,3.5,9,"1-Stage","ECM - 5-speed","2013-04-10"]
["Johnson Controls","RBS","RBSV/RBSH042**4*4","042","Full",39200,14.2,11,51000,4.9000000000000004,11,47000,22,11,41400,4.5,11,42000,16.600000000000001,11,30500,3.5,11,"1-Stage","ECM - 5-speed","2013-04-10"]
["Johnson Controls","RBS","RBSV/RBSH048**4*4","048","Full",47200,14,12,59000,4.8,12,57000,21,12,48000,4.2,12,49500,16,12,36500,3.5,12,"1-Stage","ECM - 5-speed","2013-04-10"]
["Johnson Controls","RBS","RBSV/RBSH060**4*4","060","Full",57000,14,15,66000,4.5999999999999996,15,67000,22,15,55000,4.2,15,58000,16,15,43000,3.5,15,"1-Stage","ECM - 5-speed","2013-04-10"]
["Johnson Controls","RBS","RBSV/RBSH070**4*4","070","Full",66000,14.6,18,80000,4.7,18,75000,22,18,64000,4.2,18,68000,16.600000000000001,18,49000,3.5,18,"1-Stage","ECM - 5-speed","2013-04-10"]
["Johnson Controls","RBS","RBSV/RBSH006**9*0","006","Full",7100,13.4,2,8000,4.3,2,8400,21.3,2,6800,3.8,2,7400,15.5,2,5400,3.2,2,"1-Stage","PSC","2013-04-10"]
["Johnson Controls","RBS","RBSV/RBSH009**9*0","009","Full",8100,12.2,3,11400,4.5999999999999996,3,9900,19.2,3,9600,4,3,8900,14.5,3,7600,3.4,3,"1-Stage","PSC","2013-04-10"]
["Johnson Controls","RBS","RBSV/RBSH012**9*0","012","Full",10200,12.2,3,15200,4.4000000000000004,3,12200,18.2,3,12600,3.9,3,11200,14.2,3,10200,3.5,3,"1-Stage","PSC","2013-04-10"]
["Johnson Controls","RBS","RBSV/RBSH015**2*0","015","Full",13200,12.5,4,15400,4.5,4,16000,20,4,13000,4,4,14000,15.3,4,10400,3.2,4,"1-Stage","PSC","2013-04-10"]
["Johnson Controls","RBS","RBSV/RBSH018**2*0","018","Full",17300,13.4,5,19000,4.3,5,19800,20.5,5,16000,3.7,5,18000,15.4,5,12600,3.2,5,"1-Stage","PSC","2013-04-10"]
["Johnson Controls","RBS","RBSV/RBSH024**4*0","024","Full",22900,13,6,26000,4.5,6,27000,19.8,6,22600,4,6,24500,14.8,6,17000,3.3,6,"1-Stage","PSC","2013-04-10"]
["Johnson Controls","RBS","RBSV/RBSH030**4*0","030","Full",28400,13.8,8,34000,4.5,8,33500,21,8,28000,4,8,30000,16,8,21000,3.3,8,"1-Stage","PSC","2013-04-10"]
["Johnson Controls","RBS","RBSV/RBSH036**4*0","036","Full",34500,14,9,43800,4.7,9,40000,22,9,35600,4.2,9,36000,16.3,9,26000,3.3,9,"1-Stage","PSC","2013-04-10"]
["Johnson Controls","RBS","RBSV/RBSH042**5*0","042","Full",39200,13.2,11,51000,4.7,11,47000,20.399999999999999,0,41400,4.3,11,42000,15.2,11,30500,3.3,11,"1-Stage","PSC","2013-04-10"]
["Johnson Controls","RBS","RBSV/RBSH048**5*0","048","Full",47200,13,12,59000,4.5999999999999996,12,57000,19.8,12,48000,4,12,49500,15,12,36500,3.3,12,"1-Stage","PSC","2013-04-10"]
["Johnson Controls","RBS","RBSV/RBSH060**5*0","060","Full",57000,13.5,15,66000,4.3,15,67000,21,15,55000,4,15,58000,15.2,15,43000,3.3,15,"1-Stage","PSC","2013-04-10"]
["Johnson Controls","RBS","RBSV/RBSH070**5*0","070","Full",66000,14,18,80000,4.5,18,75000,20.5,18,64000,4,18,68000,15.6,18,49000,3.3,18,"1-Stage","PSC","2013-04-10"]
["Johnson Controls","RC","RCC/RCW/RCS/RCE09*2","009","Full",8500,13.4,2.5,10500,4.4000000000000004,2.5,10200,22.5,2.5,8700,3.8,2.5,9000,16,2.5,6700,3.1,2.5,"1-Stage","PSC","2013-04-10"]
["Johnson Controls","RC","RCC/RCW/RCS/RCE12*2","012","Full",10500,12.3,3.5,14400,4.3,3.5,12400,19.5,3.5,11800,3.7,3.5,11000,14.2,3.5,9500,3.5,3.5,"1-Stage","PSC","2013-04-10"]
["Johnson Controls","RC","RCC/RCW/RCS/RCE15*2","015","Full",13500,13.6,4.5,17000,4.9000000000000004,4.5,16200,22,4.5,14000,4.0999999999999996,4.5,14200,15.9,4.5,10500,3.4,4.5,"1-Stage","PSC","2013-04-10"]
["Johnson Controls","RC","RCC/RCW/RCS/RCE18*2","018","Full",16200,12.5,5.5,21000,4.4000000000000004,5.5,19000,19.600000000000001,5.5,17000,3.7,5.5,16600,15.1,5.5,13300,3.1,5.5,"1-Stage","PSC","2013-04-10"]
["Johnson Controls","RGS","RGSH023**4*1","023","Full",23000,15,6,26000,4.7,6,25400,23,6,21900,4.3,6,23900,17,6,17000,3.6,6,"1-Stage","ECM - CA","2013-04-10"]
["Johnson Controls","RGS","RGSV/RGSH015**2*1","015","Full",14000,15.3,4,16500,4.9000000000000004,4,16000,24.3,4,15000,4.4000000000000004,4,14700,17.5,4,11500,3.7,4,"1-Stage","ECM - CA","2013-04-10"]
["Johnson Controls","RGS","RGSV/RGSH018**2*1","018","Full",17600,15.2,5,21000,4.8,5,20600,24,5,17500,4.4000000000000004,5,18500,17.5,5,13700,3.7,5,"1-Stage","ECM - CA","2013-04-10"]
["Johnson Controls","RGS","RGSV/RGSH024**4*1","024","Full",23900,15.1,6,27000,5,6,26400,23.4,6,22300,4.5,6,24400,17.5,6,17500,3.8,6,"1-Stage","ECM - CA","2013-04-10"]
["Johnson Controls","RGS","RGSV/RGSH030**4*1","030","Full",29500,15.7,8,34600,5.0999999999999996,8,32900,23.9,8,28300,4.4000000000000004,8,29000,18.3,8,22800,3.8,8,"1-Stage","ECM - CA","2013-04-10"]
["Johnson Controls","RGS","RGSV/RGSH036**4*1","036","Full",33300,15,9,40600,4.8,9,37700,23,9,33000,4.3,9,34500,17.3,9,26000,3.6,9,"1-Stage","ECM - CA","2013-04-10"]
["Johnson Controls","RGS","RGSV/RGSH042**4*1","042","Full",40800,15.6,11,45400,5,11,45800,23.5,11,37000,4.3,11,42300,18.5,11,29900,3.7,11,"1-Stage","ECM - CA","2013-04-10"]
["Johnson Controls","RGS","RGSV/RGSH048**4*1","048","Full",47700,15.5,12,56000,4.8,12,52000,23.4,12,45900,4.2,12,49500,18.100000000000001,12,36900,3.6,12,"1-Stage","ECM - CA","2013-04-10"]
["Johnson Controls","RGS","RGSV/RGSH060**4*1","060","Full",58400,15.3,15,72500,4.7,15,65500,23,15,58400,4.0999999999999996,15,60900,17.899999999999999,15,47100,3.6,15,"1-Stage","ECM - CA","2013-04-10"]
["Johnson Controls","RGS","RGSV/RGSH070**4*1","070","Full",63000,14.3,18,79000,4.7,18,70000,21.1,18,64100,4.0999999999999996,18,68500,17.100000000000001,18,51600,3.6,18,"1-Stage","ECM - CA","2013-04-10"]
["Johnson Controls","RGS","RGSV041**4*1","041","Full",40000,14.5,11,45000,4.5,11,44500,22,11,36000,4,11,41000,16.5,11,29000,3.5,11,"1-Stage","ECM - CA","2013-04-10"]
["Johnson Controls","RGS","RGSH023**4*0","023","Full",23000,14.5,6,26000,4.5,6,25400,22.5,6,21900,3.9,6,23900,16.8,6,17000,3.4,6,"1-Stage","PSC","2013-04-10"]
["Johnson Controls","RGS","RGSV/RGSH009**2*0","009","Full",8500,12,3,11500,4.4000000000000004,3,10500,18.2,3,9600,3.7,3,9100,13.5,3,7600,3,3,"1-Stage","PSC","2013-04-10"]
["Johnson Controls","RGS","RGSV/RGSH012**2*0","012","Full",10900,12.7,3.5,14700,4.4000000000000004,3.5,12500,18.2,3.5,12000,3.8,3.5,11500,14.7,3.5,9600,3.2,3.5,"1-Stage","PSC","2013-04-10"]
["Johnson Controls","RGS","RGSV/RGSH015**2*0","015","Full",14000,15,4,16500,4.8,4,16000,24,4,15000,4.0999999999999996,4,14700,17.2,4,11500,3.5,4,"1-Stage","PSC","2013-04-10"]
["Johnson Controls","RGS","RGSV/RGSH018**2*0","018","Full",17600,14.6,5,21000,4.7,5,20600,23.5,5,17500,4,5,18500,17,5,13700,3.5,5,"1-Stage","PSC","2013-04-10"]
["Johnson Controls","RGS","RGSV/RGSH024**4*0","024","Full",23900,14.6,6,27000,4.7,6,26400,22.8,6,22300,4,6,24400,17,6,17500,3.5,6,"1-Stage","PSC","2013-04-10"]
["Johnson Controls","RGS","RGSV/RGSH030**4*0","030","Full",29500,14.9,8,34600,4.8,8,32900,23,8,28300,4,8,29000,17,8,22800,3.5,8,"1-Stage","PSC","2013-04-10"]
["Johnson Controls","RGS","RGSV/RGSH036**4*0","036","Full",33300,14.4,9,40600,4.5,9,37700,21.2,9,33000,3.9,9,34500,16.600000000000001,9,26000,3.3,9,"1-Stage","PSC","2013-04-10"]
["Johnson Controls","RGS","RGSV/RGSH042**5*0","042","Full",40800,14.5,11,45400,4.5,11,45800,22.8,11,37000,3.8,11,42300,16.8,11,29000,3.3,11,"1-Stage","PSC","2013-04-10"]
["Johnson Controls","RGS","RGSV/RGSH048**5*0","048","Full",47700,14.7,12,56000,4.4000000000000004,12,52000,21,12,45900,3.8,12,49500,16.8,12,36900,3.3,12,"1-Stage","PSC","2013-04-10"]
["Johnson Controls","RGS","RGSV/RGSH060**5*0","060","Full",58400,14.7,15,72500,4.4000000000000004,15,65500,20.8,15,58400,3.8,15,60900,16.600000000000001,15,47100,3.3,15,"1-Stage","PSC","2013-04-10"]
["Johnson Controls","RGS","RGSV/RGSH070**5*0","070","Full",63000,14.2,18,79000,4.4000000000000004,18,70000,20.3,18,64100,3.8,18,68500,15.2,18,51600,3.3,18,"1-Stage","PSC","2013-04-10"]
["Johnson Controls","RGS","RGSV041**5*0","041","Full",40000,13.8,11,45000,4.3,11,44500,20.6,11,36000,3.8,11,41000,15.8,11,29000,3.3,11,"1-Stage","PSC","2013-04-10"]
["Johnson Controls","RJS","RJSV/RJSH015**2*1","015","Full",14400,16.5,4,18500,5.3,4,16700,27,4,15500,4.7,4,15000,18,4,12000,3.8,4,"1-Stage","ECM - CA","2014-04-11"]
["Johnson Controls","RJS","RJSV/RJSH018**2*1","018","Full",18000,16.5,5,23000,5.3,5,21000,26.8,5,19000,4.7,5,18500,19,5,14700,4.0999999999999996,5,"1-Stage","ECM - CA","2014-04-11"]
["Johnson Controls","RJS","RJSV/RJSH022**2*1","022","Full",20700,17.5,8,25300,6.2,8,23500,30,8,19800,5.3,8,21700,21,8,15000,4,8,"1-Stage","ECM - CA","2014-04-11"]
["Johnson Controls","RJS","RJSV/RJSH030**2*1","030","Full",28300,19.2,8,32700,5.8,8,31300,28.8,8,25800,5,8,29400,21.9,8,20000,4,8,"1-Stage","ECM - CA","2014-04-11"]
["Johnson Controls","RJS","RJSV/RJSH036**2*1","036","Full",34500,19.600000000000001,9,38000,6.1,9,37200,30.1,9,30300,5.2,9,35000,22,9,24100,4.4000000000000004,9,"1-Stage","ECM - CA","2014-04-11"]
["Johnson Controls","RJS","RJSV/RJSH042**4*1","042","Full",40600,19.2,11,44100,5.9,11,45200,29.5,11,34900,5.2,11,42000,21.4,11,27500,4.2,11,"1-Stage","ECM - CA","2014-04-11"]
["Johnson Controls","RJS","RJSV/RJSH048**4*1","048","Full",47000,17.5,12,55400,5.5,12,52000,26.1,12,45100,4.8,12,49300,19.7,12,35300,4,12,"1-Stage","ECM - CA","2014-04-11"]
["Johnson Controls","RJS","RJSV/RJSH060**4*1","060","Full",64300,17.2,15,69800,5.4,15,72000,26.1,15,55100,4.7,15,66800,19.5,15,43200,3.9,15,"1-Stage","ECM - CA","2014-04-11"]
["Johnson Controls","RJS","RJSV/RJSH070**4*1","070","Full",70600,16,18,84300,5.0999999999999996,18,79000,23.8,18,66000,4.4000000000000004,18,73200,18.2,18,52000,3.7,18,"1-Stage","ECM - CA","2014-04-11"]
["Johnson Controls","RJS","RJSV/RJSH009**0","009","Full",9300,14.5,3,12100,5.2,3,10800,22.2,3,10100,4.3,3,9800,16.7,3,7700,3.4,3,"1-Stage","PSC","2014-04-11"]
["Johnson Controls","RJS","RJSV/RJSH012**0","012","Full",11700,15.4,3.5,14000,4.9000000000000004,3.5,14000,25.5,3.5,11900,4.2,3.5,12500,18,3.5,9500,3.6,3.5,"1-Stage","PSC","2014-04-11"]
["Johnson Controls","RJS","RJSV/RJSH015**2*0","015","Full",14400,15.9,4,18500,5.3,4,16700,26,4,15500,4.5,4,15000,18,4,12000,3.8,4,"1-Stage","PSC","2014-04-11"]
["Johnson Controls","RJS","RJSV/RJSH018**2*0","018","Full",18000,15.6,5,23000,5.0999999999999996,5,21000,25.5,5,19000,4.4000000000000004,5,18500,18,5,14700,3.8,5,"1-Stage","PSC","2014-04-11"]
["Johnson Controls","RJS","RJSV/RJSH022**2*0","022","Full",20600,17.2,8,25000,6,8,23000,28,8,19800,5,8,21200,20.3,8,15000,3.8,8,"1-Stage","PSC","2014-04-11"]
["Johnson Controls","RJS","RJSV/RJSH030**2*0","030","Full",28100,18.2,8,32700,5.5,8,30900,27.1,8,25800,4.8,8,29200,21.1,8,19800,3.8,8,"1-Stage","PSC","2014-04-11"]
["Johnson Controls","RJS","RJSV/RJSH036**2*0","036","Full",34100,17.600000000000001,9,37900,5.6,9,36300,25.7,9,30300,4.7,9,34600,19.600000000000001,9,24100,4,9,"1-Stage","PSC","2014-04-11"]
["Johnson Controls","RJS","RJSV/RJSH042**5*0","042","Full",40100,16.600000000000001,11,44100,5.3,11,44600,24.5,11,34900,4.5999999999999996,11,41600,18.600000000000001,11,27500,3.7,11,"1-Stage","PSC","2014-04-11"]
["Johnson Controls","RJS","RJSV/RJSH048**5*0","048","Full",46400,15.5,12,55400,5,12,51600,22.5,12,45100,4.3,12,48900,17.3,12,35300,3.6,12,"1-Stage","PSC","2014-04-11"]
["Johnson Controls","RJS","RJSV/RJSH060**5*0","060","Full",64000,16,15,69800,5.0999999999999996,15,71700,24.6,15,55100,4.4000000000000004,15,66800,18.5,15,43200,3.7,15,"1-Stage","PSC","2014-04-11"]
["Johnson Controls","RJS","RJSV/RJSH070**5*0","070","Full",70600,15.1,18,84300,4.7,18,77500,21.6,18,66100,4,18,73200,17.2,18,52000,3.4,18,"1-Stage","PSC","2014-04-11"]
["Johnson Controls","RJT 2-stage","RJTV/RJTH026**4","026","Full",26000,16,8,31000,5.5,8,29000,24,8,25300,5,8,27200,18.600000000000001,8,19500,4.2,8,"2-Stage","ECM - CA","2013-04-10"]
["Johnson Controls","RJT 2-stage","RJTV/RJTH038**4","038","Full",39000,17.2,9,42200,5.5,9,39400,24.1,9,34800,5,9,40200,20.100000000000001,9,27000,4.2,9,"2-Stage","ECM - CA","2013-04-10"]
["Johnson Controls","RJT 2-stage","RJTV/RJTH049**4","049","Full",48300,15.8,12,57400,5.0999999999999996,12,53200,22.7,12,47200,4.7,12,50000,18,12,37400,4.0999999999999996,12,"2-Stage","ECM - CA","2013-04-10"]
["Johnson Controls","RJT 2-stage","RJTV/RJTH064**4","064","Full",64500,16.2,16,72500,5.0999999999999996,16,70700,22.7,16,56800,4.5999999999999996,16,67600,18,16,45800,3.9,16,"2-Stage","ECM - CA","2013-04-10"]
["Johnson Controls","RJT 2-stage","RJTV/RJTH072**4","072","Full",71000,15,18,86700,5,18,79900,20.399999999999999,18,67900,4.4000000000000004,18,73600,16.8,18,54100,3.8,18,"2-Stage","ECM - CA","2013-04-10"]
["Johnson Controls","RKS","RKSV/RKSH022G1*4","022","Full",21900,19.5,8,22800,5.7,8,24800,30,8,18200,4.8,8,23000,23,8,14200,3.9,8,"1-Stage","ECM - 5-speed","2014-04-11"]
["Johnson Controls","RKS","RKSV/RKSH030G1*4","030","Full",27800,19.2,8,30600,5.7,8,31200,29.5,8,24400,4.8,8,29400,21.9,8,20000,4,8,"1-Stage","ECM - 5-speed","2014-04-11"]
["Johnson Controls","RKS","RKSV/RKSH036G1*4","036","Full",34900,21.6,9,34200,6,9,38000,30.1,9,28200,5.0999999999999996,9,35400,22.4,9,24100,4.4000000000000004,9,"1-Stage","ECM - 5-speed","2014-04-11"]
["Johnson Controls","RKS","RKSV/RKSH042G1*4","042","Full",40800,20,11,42800,5.7,11,46200,29.5,11,35000,4.9000000000000004,11,42000,21.8,11,27500,4.2,11,"1-Stage","ECM - 5-speed","2014-04-11"]
["Johnson Controls","RKS","RKSV/RKSH048G1*4","048","Full",47300,18.5,12,53100,5.4,12,53000,26.1,12,43400,4.7,12,49300,20.100000000000001,12,35000,3.9,12,"1-Stage","ECM - 5-speed","2014-04-11"]
["Johnson Controls","RKS","RKSV/RKSH060G1*4","060","Full",61300,16.600000000000001,15,69000,5.3,15,69000,24.7,15,57000,4.7,15,66500,19.2,15,45000,4,15,"1-Stage","ECM - 5-speed","2014-04-11"]
["Johnson Controls","RKS","RKSV/RKSH070G1*4","070","Full",67000,15.4,18,81800,5,18,77400,23.8,18,67000,4.4000000000000004,18,70600,18,18,52500,3.7,18,"1-Stage","ECM - 5-speed","2014-04-11"]
["Johnson Controls","RKS","RKSV/RKSH015**2*1","015","Full",14400,16.5,4,18500,5.3,4,16700,27,4,15500,4.7,4,15000,18,4,12000,3.8,4,"1-Stage","ECM - CA","2014-04-11"]
["Johnson Controls","RKS","RKSV/RKSH018**2*1","018","Full",18000,16.5,5,23000,5.3,5,21000,26.8,5,19000,4.7,5,18500,19,5,14700,4.0999999999999996,5,"1-Stage","ECM - CA","2014-04-11"]
["Johnson Controls","RKS","RKSV/RKSH022**2*1","022","Full",20700,17.5,8,25300,6.2,8,23500,30,8,19800,5.3,8,21700,21,8,15000,4,8,"1-Stage","ECM - CA","2014-04-11"]
["Johnson Controls","RKS","RKSV/RKSH030**2*1","030","Full",28300,19.2,8,32700,5.8,8,31300,28.8,8,25800,5,8,29400,21.9,8,20000,4,8,"1-Stage","ECM - CA","2014-04-11"]
["Johnson Controls","RKS","RKSV/RKSH036**2*1","036","Full",34500,19.600000000000001,9,38000,6.1,9,37200,30.1,9,30300,5.2,9,35000,22,9,24100,4.4000000000000004,9,"1-Stage","ECM - CA","2014-04-11"]
["Johnson Controls","RKS","RKSV/RKSH042**4*1","042","Full",40600,19.2,11,44100,5.9,11,45200,29.5,11,34900,5.2,11,42000,21.4,11,27500,4.2,11,"1-Stage","ECM - CA","2014-04-11"]
["Johnson Controls","RKS","RKSV/RKSH048**4*1","048","Full",47000,17.5,12,55400,5.5,12,52000,26.1,12,45100,4.8,12,49300,19.7,12,35300,4,12,"1-Stage","ECM - CA","2014-04-11"]
["Johnson Controls","RKS","RKSV/RKSH060**4*1","060","Full",64300,17.2,15,69800,5.4,15,72000,26.1,15,55100,4.7,15,66800,19.5,15,43200,3.9,15,"1-Stage","ECM - CA","2014-04-11"]
["Johnson Controls","RKS","RKSV/RKSH070**4*1","070","Full",70600,16,18,84300,5.0999999999999996,18,79000,23.8,18,66000,4.4000000000000004,18,73200,18.2,18,52000,3.7,18,"1-Stage","ECM - CA","2014-04-11"]
["Johnson Controls","RKS","RKSV/RKSH009**2*0","009","Full",9600,14.5,3,13200,5.2,3,10800,22.2,3,10600,4.4000000000000004,3,9800,16.7,3,7800,3.4,3,"1-Stage","PSC","2014-04-11"]
["Johnson Controls","RKS","RKSV/RKSH012**2*0","012","Full",12300,15.7,3.5,14800,5.0999999999999996,3.5,14500,25.5,3.5,12300,4.5,3.5,13000,18,3.5,9600,3.7,3.5,"1-Stage","PSC","2014-04-11"]
["Johnson Controls","RKS","RKSV/RKSH015**2*0","015","Full",14400,15.9,4,18500,5.3,4,16700,26,4,15500,4.5,4,15000,18,4,12000,3.8,4,"1-Stage","PSC","2014-04-11"]
["Johnson Controls","RKS","RKSV/RKSH018**2*0","018","Full",18000,15.6,5,23000,5.0999999999999996,5,21000,25.5,5,19000,4.4000000000000004,5,18500,18,5,14700,3.8,5,"1-Stage","PSC","2014-04-11"]
["Johnson Controls","RKS","RKSV/RKSH022**2*0","022","Full",20600,17.2,8,25000,6,8,23000,28,8,19800,5,8,21200,20.3,8,15000,3.8,8,"1-Stage","PSC","2014-04-11"]
["Johnson Controls","RKS","RKSV/RKSH030**2*0","030","Full",28100,18.2,8,32700,5.5,8,30900,27.1,8,25800,4.8,8,29200,21.1,8,19800,3.8,8,"1-Stage","PSC","2014-04-11"]
["Johnson Controls","RKS","RKSV/RKSH036**2*0","036","Full",34100,17.600000000000001,9,37900,5.6,9,36300,25.7,9,30300,4.7,9,34600,19.600000000000001,9,24100,4,9,"1-Stage","PSC","2014-04-11"]
["Johnson Controls","RKS","RKSV/RKSH042**5*0","042","Full",40100,16.600000000000001,11,44100,5.3,11,44600,24.5,11,34900,4.5999999999999996,11,41600,18.600000000000001,11,27500,3.7,11,"1-Stage","PSC","2014-04-11"]
["Johnson Controls","RKS","RKSV/RKSH048**5*0","048","Full",46400,15.5,12,55400,5,12,51600,22.5,12,45100,4.3,12,48900,17.3,12,35300,3.6,12,"1-Stage","PSC","2014-04-11"]
["Johnson Controls","RKS","RKSV/RKSH060**5*0","060","Full",64000,16,15,69800,5.0999999999999996,15,71700,24.6,15,55100,4.4000000000000004,15,66800,18.5,15,43200,3.7,15,"1-Stage","PSC","2014-04-11"]
["Johnson Controls","RKS","RKSV/RKSH070**5*0","070","Full",70600,15.1,18,84300,4.7,18,77500,21.6,18,66100,4,18,73200,17.2,18,52000,3.4,18,"1-Stage","PSC","2014-04-11"]
["Johnson Controls","RKT 2-stage","RKTV/RKTH026**4*1","026","Full",26000,16,8,31000,5.5,8,29000,24,8,25300,5,8,27200,18.600000000000001,8,19500,4.2,8,"2-Stage","ECM - CA","2014-04-11"]
["Johnson Controls","RKT 2-stage","RKTV/RKTH026G1*4","026","Full",26000,17.3,8,30300,5.5,8,29000,24,8,25100,5,8,27700,20.399999999999999,8,19500,4.3,8,"2-Stage","ECM - CA","2014-04-11"]
["Johnson Controls","RKT 2-stage","RKTV/RKTH038**4*1","038","Full",39000,17.2,9,42200,5.5,9,39400,24.1,9,34800,5,9,40200,20.100000000000001,9,27000,4.2,9,"2-Stage","ECM - CA","2014-04-11"]
["Johnson Controls","RKT 2-stage","RKTV/RKTH038G1*4","038","Full",39000,18,9,40300,5.4,9,39400,24.1,9,33600,4.8,9,40200,21,9,26700,4.0999999999999996,9,"2-Stage","ECM - CA","2014-04-11"]
["Johnson Controls","RKT 2-stage","RKTV/RKTH049**4*1","049","Full",48300,15.8,12,57400,5.0999999999999996,12,53200,22.7,12,47200,4.7,12,50000,18,12,37400,4.0999999999999996,12,"2-Stage","ECM - CA","2014-04-11"]
["Johnson Controls","RKT 2-stage","RKTV/RKTH049G1*4","049","Full",50300,17.100000000000001,12,56100,5.2,12,56200,24.5,12,46300,4.5999999999999996,12,52000,20,12,37400,4,12,"2-Stage","ECM - CA","2014-04-11"]
["Johnson Controls","RKT 2-stage","RKTV/RKTH064**4*1","064","Full",64500,16.2,16,72500,5.0999999999999996,16,70700,22.7,16,56800,4.5999999999999996,16,67600,18,16,45800,3.9,16,"2-Stage","ECM - CA","2014-04-11"]
["Johnson Controls","RKT 2-stage","RKTV/RKTH064G1*4","064","Full",62000,16.3,16,70600,5.2,16,70100,23.9,16,58000,4.7,16,65100,18.7,16,47100,4,16,"2-Stage","ECM - CA","2014-04-11"]
["Johnson Controls","RKT 2-stage","RKTV/RKTH072**4*1","072","Full",71000,15,18,86700,5,18,79900,20.399999999999999,18,67900,4.4000000000000004,18,73600,16.8,18,54100,3.8,18,"2-Stage","ECM - CA","2014-04-11"]
["Johnson Controls","RKT 2-stage","RKTV/RKTH072G1*4","072","Full",69000,15,18,81900,4.8,18,78500,22,18,67500,4.3,18,71600,17,18,54200,3.7,18,"2-Stage","ECM - CA","2014-04-11"]
["Johnson Controls","RL","RLLH/RLXH080**5","080","Full",73000,15.5,22,77700,4.7,22,79000,22.5,22,65800,4.2,22,76000,17.7,22,51300,3.5,22,"1-Stage","Belt Drive","2013-04-10"]
["Johnson Controls","RL","RLLH/RLXH095**5","095","Full",85500,15.6,24,91000,4.8,24,95000,23,24,78000,4.3,24,91200,18.100000000000001,24,61600,3.5,24,"1-Stage","Belt Drive","2013-04-10"]
["Johnson Controls","RL","RLLH/RLXH120**5","120","Full",113000,13.8,28,140600,4.5999999999999996,28,129000,21.9,28,115000,4.0999999999999996,28,119500,16.2,28,89000,3.4,28,"1-Stage","Belt Drive","2013-04-10"]
["Johnson Controls","RL","RLLV/RLXV080T*5","080","Full",76000,16.5,22,85000,5,22,84000,24.2,22,71000,4.4000000000000004,22,83000,19.7,22,55000,3.7,22,"1-Stage","Belt Drive","2013-04-10"]
["Johnson Controls","RL","RLLV/RLXV095T*5","095","Full",91000,17.2,24,100000,5.2,24,101000,25.7,24,83000,4.5999999999999996,24,95000,19.600000000000001,24,65000,3.8,24,"1-Stage","Belt Drive","2013-04-10"]
["Johnson Controls","RL","RLLV/RLXV120T*5","120","Full",115000,15.5,28,136000,5.0999999999999996,28,135000,24.3,28,107500,4.4000000000000004,28,122000,18,28,83000,3.6,28,"1-Stage","Belt Drive","2013-04-10"]
["Johnson Controls","RL","RLLV/RLXV160T*5","160","Full",166000,18.899999999999999,35,154000,5.0999999999999996,35,178000,25.3,35,130000,4.5999999999999996,35,171000,21,35,97000,3.7,35,"1-Stage","Belt Drive","2013-04-10"]
["Johnson Controls","RL","RLLV/RLXV180T*5","180","Full",180000,17.100000000000001,45,190000,5,45,187000,22.2,45,149000,4.3,45,185000,18.5,45,109000,3.4,45,"1-Stage","Belt Drive","2013-04-10"]
["Johnson Controls","RL","RLLV/RLXV240T*5","240","Full",240000,16.3,60,296000,5.2,60,264000,22.5,60,237000,4.5999999999999996,60,246000,17.399999999999999,60,184000,3.8,60,"1-Stage","Belt Drive","2013-04-10"]
["Johnson Controls","RL","RLLV/RLXV300T*5","300","Full",284000,17.3,75,353000,5.4,75,314000,24.5,75,286000,4.8,75,291000,19,75,224000,4.2,75,"1-Stage","Belt Drive","2013-04-10"]
["Johnson Controls","RS","RSV/RSH007A6*******","007","Full",6800,12.5,1.8,8700,4.5,1.8,7700,18.399999999999999,1.8,6900,3.9,1.8,7100,14.6,1.8,5500,3.4,1.8,"1-Stage","PSC","2013-04-10"]
["Johnson Controls","RS","RSV/RSH009A6*******","009","Full",8900,12.4,2.4,11600,4.4000000000000004,2.4,10100,18.3,2.4,9100,3.8,2.4,9300,14.5,2.4,6900,3.3,2.4,"1-Stage","PSC","2013-04-10"]
["Johnson Controls","RS","RSV/RSH012A6*******","012","Full",12400,12,3,15600,4.2,3,14200,17.899999999999999,3,12900,3.6,3,13000,14,3,10200,3.1,3,"1-Stage","PSC","2013-04-10"]
["Johnson Controls","RS","RSV/RSH018A6*******","018","Full",19100,13.2,4.8,23400,4.5,4.8,22900,20.2,4.8,18800,3.9,4.8,20600,15.7,4.8,13900,3.4,4.8,"1-Stage","PSC","2013-04-10"]
["Johnson Controls","RS","RSV/RSH024A6*******","024","Full",24600,13.5,6,29300,4.4000000000000004,6,28700,20.8,6,23600,3.8,6,26400,16.100000000000001,6,17400,3.3,6,"1-Stage","PSC","2013-04-10"]
["Johnson Controls","RS","RSV/RSH030A6*******","030","Full",29800,13.3,7.8,35300,4.5,7.8,33600,20,7.8,29100,3.8,7.8,31100,15.3,7.8,22500,3.3,7.8,"1-Stage","PSC","2013-04-10"]
["Johnson Controls","RS","RSV/RSH036A6*******","036","Full",36200,13,9,45100,4.5999999999999996,9,39800,18.8,9,37200,3.9,9,37500,14.8,9,28600,3.3,9,"1-Stage","PSC","2013-04-10"]
["Johnson Controls","RS","RSV/RSH042A6*******","042","Full",42700,12.7,10.4,50600,4.4000000000000004,10.4,45800,19.100000000000001,10.4,42300,3.9,10.4,43900,14.6,10.4,32300,3.4,10.4,"1-Stage","PSC","2013-04-10"]
["Johnson Controls","RS","RSV/RSH048A6*******","048","Full",48300,13.1,12,57200,4.5,12,52500,19.3,12,47400,3.8,12,49800,15,12,37800,3.3,12,"1-Stage","PSC","2013-04-10"]
["Johnson Controls","RS","RSV/RSH060A6*******","060","Full",60500,13.4,15,70800,4.5999999999999996,15,66400,19.8,15,59000,4,15,62900,15.6,15,47200,3.5,15,"1-Stage","PSC","2013-04-10"]
["Johnson Controls","RS","RSV/RSH070A6*******","070","Full",67700,12.9,17.5,79500,4.3,17.5,73600,18.7,17.5,66800,3.8,17.5,70100,14.7,17.5,52400,3.3,17.5,"1-Stage","PSC","2013-04-10"]
["Johnson Controls","VSC","VSCS09B6****0","009","Full",8900,13,2.6,11800,4.7,2.6,10100,19.5,2.6,9300,3.9,2.6,9300,14.2,2.6,7000,3.1,2.6,"1-Stage","PSC","2013-04-10"]
["Johnson Controls","VSC","VSCS12B6****0","012","Full",12200,13,3.2,14900,4.4000000000000004,3.2,14400,19.8,3.2,12200,3.6,3.2,13100,14.5,3.2,9600,3.2,3.2,"1-Stage","PSC","2013-04-10"]
["Johnson Controls","VSC","VSCS18B6****0","018","Full",18100,13.2,4.8,22300,4.5999999999999996,4.8,20900,20.6,4.8,17900,4,4.8,18800,15.2,4.8,14000,3.1,4.8,"1-Stage","PSC","2013-04-10"]
["Johnson Controls","VSC","VSCS24B6****0","024","Full",24400,13.4,6.2,30200,4.5999999999999996,6.2,27600,21.5,6.2,23800,3.8,6.2,25900,15.7,6.2,18100,3.1,6.2,"1-Stage","PSC","2013-04-10"]
["Johnson Controls","VSC","VSCS30B6****0","030","Full",29700,13.3,7.8,34900,4.4000000000000004,7.8,33500,20.5,7.8,28600,3.6,7.8,31800,15.2,7.8,22100,3.1,7.8,"1-Stage","PSC","2013-04-10"]
["Johnson Controls","VSC","VSCS36B6****0","036","Full",34900,12.8,9.5,36400,4.3,9.5,39200,19.399999999999999,9.5,29100,3.6,9.5,36400,14,9.5,22900,3.1,9.5,"1-Stage","PSC","2013-04-10"]
["Mammoth","HHA / HLA","D006HHA","006","Full",7200,13,1.8,9100,4.8,1.8,0,0,0,0,0,0,7500,14.6,1.8,5300,3.1,1.8,"1-Stage","PSC","2013-04-10"]
["Mammoth","HHA / HLA","D009HHA","009","Full",9500,14,2.6,1120,4.7,2.6,0,0,0,0,0,0,10400,16.399999999999999,2.6,6400,3,2.6,"1-Stage","PSC","2013-04-10"]
["Mammoth","HHA / HLA","D012HHA","012","Full",12200,12.95,3.5,13600,4.5,3.5,0,0,0,0,0,0,13500,16.3,3.5,7800,2.9,3.5,"1-Stage","PSC","2013-04-10"]
["Mammoth","HHA / HLA","D015HHA","015","Full",15500,17.600000000000001,4.5,16700,5.3,4.5,0,0,0,0,0,0,16200,19.7,4.5,9800,3.4,4.5,"1-Stage","ECM - CA","2013-04-10"]
["Mammoth","HHA / HLA","D018HHA","018","Full",19500,17.399999999999999,5,20800,5.0999999999999996,5,0,0,0,0,0,0,20500,19.3,5,12200,3.3,5,"1-Stage","ECM - CA","2013-04-10"]
["Mammoth","HHA / HLA 2-stage","D024HHA","024","Full",27800,17.2,6.5,28700,4.9000000000000004,6.5,0,0,0,0,0,0,28600,18.8,6.5,16400,3.1,6.5,"2-Stage","ECM - CA","2013-04-10"]
["Mammoth","HHA / HLA 2-stage","D030HHA","030","Full",33200,17.100000000000001,9,37600,4.9000000000000004,9,0,0,0,0,0,0,34100,18.600000000000001,9,21500,3.1,9,"2-Stage","ECM - CA","2013-04-10"]
["Mammoth","HHA / HLA 2-stage","D036HHA","036","Full",38500,16,10.5,40100,4.7,10.5,0,0,0,0,0,0,40400,17.899999999999999,10.5,23500,3,10.5,"2-Stage","ECM - CA","2013-04-10"]
["Mammoth","HHA / HLA 2-stage","D042HHA","042","Full",47100,15.55,12,47100,4.5,12,0,0,0,0,0,0,48300,18.100000000000001,12,27000,2.9,12,"2-Stage","ECM - CA","2013-04-10"]
["Mammoth","HHA / HLA 2-stage","D048HHA","048","Full",45500,15.5,14,58900,5,14,0,0,0,0,0,0,52200,18.899999999999999,14,33800,3.2,14,"2-Stage","ECM - CA","2013-04-10"]
["Mammoth","HHA / HLA 2-stage","D060HHA","060","Full",63000,15.8,17,70000,4.8,17,0,0,0,0,0,0,66300,17.7,17,41000,3.1,17,"2-Stage","ECM - CA","2013-04-10"]
["Mammoth","HHA / HLA 2-stage","D072HHA","072","Full",75800,16,20,81800,4.3,20,0,0,0,0,0,0,75700,17.399999999999999,20,47900,2.8,20,"2-Stage","ECM - CA","2013-04-10"]
["Mammoth","HHM / HLM","F084HHM/HLM","084","Full","83800",14.8,"22.00","96100","4.80","22.00",0,0,0,0,0,0,86000,15.5,"22.00",55000,2.8,"22.00","1-Stage","Direct Drive - BI","2013-04-10"]
["Mammoth","HHM / HLM","F096HHM/HLM","096","Full","96700",15,"26.00",113100,"4.70","26.00",0,0,0,0,0,0,99500,16,"26.00",64500,2.8,"26.00","1-Stage","Direct Drive - BI","2013-04-10"]
["Mammoth","HHM / HLM","F120HHM/HLM","120","Full","117000","13.00","32.00","138000","4.30","32.00",0,0,0,0,0,0,128000,15.5,"32.00",81000,2.8,"32.00","1-Stage","Direct Drive - BI","2013-04-10"]
["Mammoth","HHM / HLM","F144HHM/HLM","144","Full",139800,14.3,35,158200,4.4000000000000004,35,0,0,0,0,0,0,138200,14.1,35,91700,2.8,35,"1-Stage","Direct Drive - BI","2013-04-10"]
["Mammoth","HHU / HLU","D009HHU/HLU","009","Full",9100,12,2.4,11100,4.5,2.4,0,0,0,0,0,0,9800,14.3,2.4,6500,3.1,2.4,"1-Stage","PSC","2014-04-11"]
["Mammoth","HHU / HLU","D013HHU/HLU","013","Full",11000,11.5,3.3,14100,4.2,3.3,0,0,0,0,0,0,12000,13.4,3.3,8700,2.9,3.3,"1-Stage","PSC","2014-04-11"]
["Mammoth","HHU / HLU","D016HHU/HLU","016","Full",14200,13.6,3.8,16900,4.5,3.8,0,0,0,0,0,0,14900,16.3,3.8,9800,3.2,3.8,"1-Stage","PSC","2014-04-11"]
["Mammoth","HHU / HLU","D019HHU/HLU","019","Full",17400,13,4.5,21500,4.8,4.5,0,0,0,0,0,0,18300,15.7,4.5,12500,3.1,4.5,"1-Stage","PSC","2014-04-11"]
["Mammoth","HHU / HLU","D024HHU/HLU","024","Full",26000,16,6,29000,5,6,0,0,0,0,0,0,27400,18,6,16800,3.2,6,"1-Stage","PSC","2014-04-11"]
["Mammoth","HHU / HLU","D030HHU/HLU","030","Full",30200,15.2,8,33000,4.8,8,0,0,0,0,0,0,31700,16.899999999999999,8,19100,3.1,8,"1-Stage","PSC","2014-04-11"]
["Mammoth","HHU / HLU","D036HHU/HLU","036","Full",37700,14.2,9,38200,4.5999999999999996,9,0,0,0,0,0,0,39600,15.9,9,22100,2.9,9,"1-Stage","PSC","2014-04-11"]
["Mammoth","HHU / HLU","D043HHU/HLU","043","Full",44500,14.3,12,47800,4.8,12,0,0,0,0,0,0,48200,17,12,28200,3.2,12,"1-Stage","PSC","2014-04-11"]
["Mammoth","HHU / HLU","D052HHU/HLU","052","Full",48800,14.8,14,49800,4.5,14,0,0,0,0,0,0,52700,18.399999999999999,14,30100,3.1,14,"1-Stage","PSC","2014-04-11"]
["Mammoth","HHU / HLU","D062HHU/HLU","062","Full",59400,14,16,65800,4.2,16,0,0,0,0,0,0,62800,15.6,16,38300,2.6,16,"1-Stage","PSC","2014-04-11"]
["Mammoth","VHA / VLA","D012VHA","012","Full",12200,13.55,3.5,14300,4.5,3.5,0,0,0,0,0,0,13300,17,3.5,8200,2.9,3.5,"1-Stage","PSC","2013-04-10"]
["Mammoth","VHA / VLA","D015VHA","015","Full",16300,17.600000000000001,4.5,17000,5.5,4.5,0,0,0,0,0,0,17100,19.5,4.5,9800,3.4,4.5,"1-Stage","ECM - CA","2013-04-10"]
["Mammoth","VHA / VLA","D018VHA","018","Full",20700,17,5,21800,5,5,0,0,0,0,0,0,21000,19.5,5,13000,3.4,5,"1-Stage","ECM - CA","2013-04-10"]
["Mammoth","VHA / VLA 2-stage","D024VHA","024","Full",28000,17.5,7,28000,5.0999999999999996,7,0,0,0,0,0,0,28500,19.5,6.5,16400,3.2,6.5,"2-Stage","ECM - CA","2014-04-11"]
["Mammoth","VHA / VLA 2-stage","D030VHA","030","Full",34700,16.399999999999999,9,35700,5.0999999999999996,9,0,0,0,0,0,0,35200,18.5,9,22100,3.3,9,"2-Stage","ECM - CA","2014-04-11"]
["Mammoth","VHA / VLA 2-stage","D036VHA","036","Full",38500,15.5,10.5,40000,4.8,10.5,0,0,0,0,0,0,39400,17.399999999999999,10.5,21500,3.1,10.5,"2-Stage","ECM - CA","2014-04-11"]
["Mammoth","VHA / VLA 2-stage","D042VHA","042","Full",44600,14.05,12,49000,4.5999999999999996,12,0,0,0,0,0,0,45500,16.600000000000001,12,28500,2.9,12,"2-Stage","ECM - CA","2014-04-11"]
["Mammoth","VHA / VLA 2-stage","D048VHA","048","Full",49700,15.1,14,54200,4.9000000000000004,14,0,0,0,0,0,0,57000,20.5,14,33500,3.2,14,"2-Stage","ECM - CA","2014-04-11"]
["Mammoth","VHA / VLA 2-stage","D060VHA","060","Full",63000,15.8,17,68800,4.5,17,0,0,0,0,0,0,66200,17.7,17,40100,2.9,17,"2-Stage","ECM - CA","2014-04-11"]
["Mammoth","VHA / VLA 2-stage","D072VHA","072","Full",76700,16,20,80500,4.5,20,0,0,0,0,0,0,73800,15.9,20,47000,2.9,20,"2-Stage","ECM - CA","2014-04-11"]
["Mammoth","VHB / VLB","D024VHB/VLB","024","Full",27000,17.5,6.5,26600,4.5,6.5,0,0,0,0,0,0,27800,19.100000000000001,6.5,16700,3.4,6.5,"1-Stage","Direct Drive - BI","2013-04-10"]
["Mammoth","VHB / VLB","D030VHB/VLB","030","Full",33000,17,9,34000,4.5,9,0,0,0,0,0,0,34200,19,9,21100,3.5,9,"1-Stage","Direct Drive - BI","2013-04-10"]
["Mammoth","VHB / VLB","D036VHB/VLB","036","Full",40000,16.5,10.5,40000,4.5,10.5,0,0,0,0,0,0,41400,18.5,10.5,24900,3.4,10.5,"1-Stage","Direct Drive - BI","2013-04-10"]
["Mammoth","VHB / VLB","D042VHB/VLB","042","Full",44600,15,12,46500,4.5,12,0,0,0,0,0,0,46100,16.7,12,28800,3.4,12,"1-Stage","Direct Drive - BI","2013-04-10"]
["Mammoth","VHB / VLB","D048VHB/VLB","048","Full",49000,15.5,14,53200,4.5,14,0,0,0,0,0,0,50700,17.399999999999999,14,32800,3.5,14,"1-Stage","Direct Drive - BI","2013-04-10"]
["Mammoth","VHB / VLB","D060VHB/VLB","060","Full",63000,16.3,17,65300,4.5,17,0,0,0,0,0,0,65000,18.3,17,40300,3.5,17,"1-Stage","Direct Drive - BI","2013-04-10"]
["Mammoth","VHB / VLB","D072VHB/VLB","072","Full",71500,15.5,20,77000,4.5,20,0,0,0,0,0,0,73800,17.3,20,47500,3.5,20,"1-Stage","Direct Drive - BI","2013-04-10"]
["Mammoth","VHM / VLM","F084VHM/VLM","084","Full",83800,14.8,22,96100,4.8,22,0,0,0,0,0,0,86000,15.5,22,55000,2.8,22,"1-Stage","Direct Drive - BI","2014-04-11"]
["Mammoth","VHM / VLM","F096VHM/VLM","096","Full",96700,15,26,113100,4.7,26,0,0,0,0,0,0,99500,16,26,64500,2.8,26,"1-Stage","Direct Drive - BI","2014-04-11"]
["Mammoth","VHM / VLM","F120VHM/VLM","120","Full",115000,13.5,32,131800,4.3,32,0,0,0,0,0,0,128000,15.5,32,81000,2.8,32,"1-Stage","Direct Drive - BI","2014-04-11"]
["Mammoth","VHM / VLM","F144VHM/VLM","144","Full",138800,14.2,35,157400,4.3,35,0,0,0,0,0,0,137200,14,35,91300,2.8,35,"1-Stage","Direct Drive - BI","2014-04-11"]
["Mammoth","VHM / VLM","F168VHM/VLM","168","Full",167800,14.8,44,192300,4.8,44,0,0,0,0,0,0,165800,14.5,44,111500,3.1,44,"1-Stage","Direct Drive - BI","2014-04-11"]
["Mammoth","VHM / VLM","F192VHM/VLM","192","Full",193500,15,52,226200,4.7,52,0,0,0,0,0,0,191300,14.7,52,131200,3,52,"1-Stage","Direct Drive - BI","2014-04-11"]
["Mammoth","VHM / VLM","F240VHM/VLM","240","Full",249900,14.7,64,283300,4.5,64,0,0,0,0,0,0,247000,14.4,64,164300,2.9,64,"1-Stage","Direct Drive - BI","2014-04-11"]
["Mammoth","VHM / VLM","F288VHM/VLM","288","Full",277600,14.2,70,314900,4.3,70,0,0,0,0,0,0,274400,14,70,182600,2.8,70,"1-Stage","Direct Drive - BI","2014-04-11"]
["Mammoth","VHU / VLU","D012VHU/VLU","012","Full",11600,12.4,3.3,12000,4.5,3.3,0,0,0,0,0,0,12200,15.3,3.3,7500,2.9,3.3,"1-Stage","PSC","2014-04-11"]
["Mammoth","VHU / VLU","D024VHU/VLU","024","Full",23400,13,6,30000,4.8,6,0,0,0,0,0,0,24300,15,6,17400,3.1,6,"1-Stage","PSC","2014-04-11"]
["Mammoth","VHU / VLU","D030VHU/VLU","030","Full",27600,13,8,35300,4.8,8,0,0,0,0,0,0,28600,14.4,8,20400,3.1,8,"1-Stage","PSC","2014-04-11"]
["Mammoth","VHU / VLU","D036VHU/VLU","036","Full",35400,13,9,37000,4.3,9,0,0,0,0,0,0,37100,14.5,9,22200,2.9,9,"1-Stage","PSC","2014-04-11"]
["Mammoth","VHU / VLU","D043VHU/VLU","043","Full",40200,13,12,47000,4.3,12,0,0,0,0,0,0,43200,14.1,12,28300,2.9,12,"1-Stage","PSC","2014-04-11"]
["Mammoth","VHU / VLU","D052VHU/VLU","052","Full",49000,14.5,14,51000,4.5,14,0,0,0,0,0,0,53300,17.899999999999999,14,31100,3.2,14,"1-Stage","PSC","2014-04-11"]
["Mammoth","VHU / VLU","D062VHU/VLU","062","Full",61500,14.5,16,67000,4.2,16,0,0,0,0,0,0,64800,16.600000000000001,16,40000,2.8,16,"1-Stage","PSC","2014-04-11"]
["Mammoth","WHK / WLK","F064WHK/WLK","064","Full",56500,12,16,75000,3.7,16,0,0,0,0,0,0,57500,13.5,16,43000,2.5,16,"1-Stage","NA","2013-04-10"]
["Mammoth","WHK / WLK","F120WHK/WLK","120","Full",120000,12,33,150000,3.7,33,0,0,0,0,0,0,126000,13.5,33,93000,2.5,33,"1-Stage","NA","2013-04-10"]
["Mammoth","WHK / WLK","F170WHK/WLK","170","Full",172900,14,45,227200,4.3,45,0,0,0,0,0,0,175400,15.7,45,132800,3,45,"1-Stage","NA","2013-04-10"]
["Mammoth","WHK / WLK","F270WHK/WLK","270","Full",257300,14.3,72,338000,4.2,72,0,0,0,0,0,0,261000,15.9,72,197500,2.9,72,"1-Stage","NA","2013-04-10"]
["Mammoth","WHK / WLK","F360WHK/WLK","360","Full",350000,14.2,92,457900,4.3,92,0,0,0,0,0,0,355100,15.9,92,267600,3,92,"1-Stage","NA","2013-04-10"]
["Mammoth","WHK / WLK","F480WHK/WLK","480","Full",459500,14.3,120,593100,4.2,120,0,0,0,0,0,0,466200,15.9,120,246600,3,120,"1-Stage","NA","2013-04-10"]
["McQuay","WCCH / WCCW","WCCH/WCCW***072","072","Full",78100,13.4,20.100000000000001,82700,4.4000000000000004,20.100000000000001,82500,21.3,20.100000000000001,71400,4.2,20.100000000000001,77700,16.3,20.100000000000001,58700,3.7,20.100000000000001,"1-Stage","Belt Drive","2013-04-10"]
["McQuay","WCCH / WCCW","WCCH/WCCW***096","096","Full",94900,14.8,23.6,94300,4.3,23.6,103100,21.5,23.6,79800,3.8,23.6,97300,16.8,23.6,66100,3.3,23.6,"1-Stage","Belt Drive","2013-04-10"]
["McQuay","WCCH / WCCW","WCCH/WCCW***120","120","Full",121800,14.4,30.1,126200,4.4000000000000004,30.1,134400,20.7,30.1,115700,4.2,30.1,124600,16,30.1,92500,3.6,30.1,"1-Stage","Belt Drive","2013-04-10"]
["McQuay","WCCH / WCCW","WCCH/WCCW4015****4","015","Full",16000,17.600000000000001,3.8,18100,5.6,3.8,18200,29.3,3.8,14700,4.7,3.8,17200,20.8,3.8,11500,4,3.8,"1-Stage","ECM - CA","2014-04-11"]
["McQuay","WCCH / WCCW","WCCH/WCCW4019****4","019","Full",20900,15.7,5.3,23700,5.0999999999999996,5.3,25300,25,5.3,19900,4.5999999999999996,5.3,22600,18.399999999999999,5.3,14800,3.8,5.3,"1-Stage","ECM - CA","2014-04-11"]
["McQuay","WCCH / WCCW","WCCH/WCCW4024****4","024","Full",24700,14.7,6.2,28500,4.9000000000000004,6.2,29600,23.5,6.2,23600,4.4000000000000004,6.2,26300,17,6.2,18100,3.7,6.2,"1-Stage","ECM - CA","2014-04-11"]
["McQuay","WCCH / WCCW","WCCH/WCCW4070****4","070","Full",71300,12.7,18,88100,4.2,18,77600,17.7,18,73400,3.8,18,73800,14.3,18,59300,3.3,18,"1-Stage","ECM - CA","2014-04-11"]
["McQuay","WCCH / WCCW","WCCH/WCCW5030****4","030","Full",30500,15.9,7.6,36100,5.3,7.6,33600,23.9,7.6,29500,4.5999999999999996,7.6,31600,18.399999999999999,7.6,23000,3.8,7.6,"1-Stage","ECM - CA","2014-04-11"]
["McQuay","WCCH / WCCW","WCCH/WCCW5036****4","036","Full",36000,16,9,42400,5.2,9,40900,25,9,35900,4.5,9,38000,18.8,9,28700,3.8,9,"1-Stage","ECM - CA","2014-04-11"]
["McQuay","WCCH / WCCW","WCCH/WCCW5042****4","042","Full",43000,15.5,10.7,51600,5.2,10.7,47000,22.7,10.7,42800,4.5,10.7,44100,17.899999999999999,10.7,34600,3.8,10.7,"1-Stage","ECM - CA","2014-04-11"]
["McQuay","WCCH / WCCW","WCCH/WCCW5048****4","048","Full",48700,15.6,12.3,57700,5.2,12.3,54600,24.1,12.3,48700,4.5999999999999996,12.3,50600,18.2,12.3,39300,3.9,12.3,"1-Stage","ECM - CA","2014-04-11"]
["McQuay","WCCH / WCCW","WCCH/WCCW5060****4","060","Full",59700,15.5,15.2,69300,5.2,15.2,61300,22.1,15.2,59200,4.7,15.2,61700,17.899999999999999,15.2,48000,3.9,15.2,"1-Stage","ECM - CA","2014-04-11"]
["McQuay","WCCH / WCCW","WCCH/WCCW4007****1","007","Full",8000,11.8,2.2000000000000002,10700,4.2,2.2000000000000002,10200,20.100000000000001,2.2000000000000002,9100,3.8,2.2000000000000002,8900,14.4,2.2000000000000002,7100,3.1,2.2000000000000002,"1-Stage","PSC","2014-04-11"]
["McQuay","WCCH / WCCW","WCCH/WCCW4009****1","009","Full",8800,12.9,2.2999999999999998,11800,4.5999999999999996,2.2999999999999998,10800,21.8,2.2999999999999998,9800,4.0999999999999996,2.2999999999999998,9200,14.8,2.2999999999999998,7400,3.3,2.2999999999999998,"1-Stage","PSC","2014-04-11"]
["McQuay","WCCH / WCCW","WCCH/WCCW4015****1","015","Full",12900,12.7,3,15800,4.3,3,14700,19.2,3,13300,3.7,3,13900,15,3,10400,3.1,3,"1-Stage","PSC","2014-04-11"]
["McQuay","WCCH / WCCW","WCCH/WCCW4019****1","019","Full",15700,16,3.8,18100,5.2,3.8,18000,25.8,3.8,14700,4.4000000000000004,3.8,16900,18.7,3.8,11500,3.7,3.8,"1-Stage","PSC","2014-04-11"]
["McQuay","WCCH / WCCW","WCCH/WCCW4024****1","024","Full",21000,14.9,5.3,23600,4.8,5.3,25400,23.6,5.3,19800,4.4000000000000004,5.3,22600,17.3,5.3,14700,3.6,5.3,"1-Stage","PSC","2014-04-11"]
["McQuay","WCCH / WCCW","WCCH/WCCW5012****1","012","Full",24700,14.4,6.2,28400,4.7,6.2,29600,22.8,6.2,23500,4.3,6.2,26300,16.600000000000001,6.2,18000,3.6,6.2,"1-Stage","PSC","2014-04-11"]
["McQuay","WCCH / WCCW","WCCH/WCCW5030****1","030","Full",30400,15.3,7.6,36200,5,7.6,33500,22.8,7.6,29500,4.2,7.6,31500,17.7,7.6,23100,3.6,7.6,"1-Stage","PSC","2014-04-11"]
["McQuay","WCCH / WCCW","WCCH/WCCW5036****1","036","Full",35800,15.2,9,42500,4.9000000000000004,9,40700,23.2,9,36000,4.4000000000000004,9,37800,17.7,9,28400,3.6,9,"1-Stage","PSC","2014-04-11"]
["McQuay","WCCH / WCCW","WCCH/WCCW5042****1","042","Full",43000,15,10.7,50700,5,10.7,47500,22.1,10.7,42200,4.3,10.7,44500,17.100000000000001,10.7,33900,3.7,10.7,"1-Stage","PSC","2014-04-11"]
["McQuay","WCCH / WCCW","WCCH/WCCW5048****1","048","Full",48400,14.1,12.3,57100,4.7,12.3,54200,20.7,12.3,48100,4.4000000000000004,12.3,50200,16.100000000000001,12.3,38400,3.5,12.3,"1-Stage","PSC","2014-04-11"]
["McQuay","WCCH / WCCW","WCCH/WCCW5060****1","060","Full",59500,14.6,15.2,69400,4.9000000000000004,15.2,61200,20.5,15.2,59300,4.0999999999999996,15.2,61500,16.8,15.2,47500,3.7,15.2,"1-Stage","PSC","2014-04-11"]
["McQuay","WDFW Variable Speed","WDFW036 - Full","036","Full",31900,16.2,9,32100,4.5999999999999996,9,38900,29.4,9,30100,4.7,9,35600,20.399999999999999,9,23400,3.9,9,"Variable","ECM - CA","2014-04-15"]
["McQuay","WDFW Variable Speed","WDFW048 - Full","048","Full",42300,15.9,12,47900,5.3,12,50900,30.5,12,40700,4.7,12,46600,20.2,12,32000,3.9,12,"Variable","ECM - CA","2014-04-15"]
["McQuay","WGS","WGSV/WGSH007B*J","007","Full",8000,16.8,2.2000000000000002,9800,5.5,2.2000000000000002,9000,26.8,2.2000000000000002,8000,4.7,2.2000000000000002,8400,19.8,2.2000000000000002,6200,3.9,2.2000000000000002,"1-Stage","ECM - CA","2013-04-10"]
["McQuay","WGS","WGSV/WGSH009B*J","009","Full",9700,16,2.4,12000,5.5,2.4,11000,25.9,2.4,9800,4.7,2.4,10200,18.8,2.4,7500,3.8,2.4,"1-Stage","ECM - CA","2013-04-10"]
["McQuay","WGS","WGSV/WGSH012B*J","012","Full",12700,15.5,3.3,15700,5.4,3.3,14200,24,3.3,12800,4.5999999999999996,3.3,13300,18.100000000000001,3.3,10000,3.9,3.3,"1-Stage","ECM - CA","2013-04-10"]
["McQuay","WGS","WGSV/WGSH015B*J","015","Full",15300,18.100000000000001,3.8,19100,5.9,3.8,16900,28.4,3.8,15300,4.9000000000000004,3.8,16000,21.2,3.8,11700,4.0999999999999996,3.8,"1-Stage","ECM - CA","2013-04-10"]
["McQuay","WGS","WGSV/WGSH019B*J","019","Full",17500,17.3,4.4000000000000004,22600,5.7,4.4000000000000004,20000,27.6,4.4000000000000004,18000,4.9000000000000004,4.4000000000000004,18700,20.6,4.4000000000000004,13800,4.0999999999999996,4.4000000000000004,"1-Stage","ECM - CA","2013-04-10"]
["McQuay","WGS","WGSV/WGSH024B*K","024","Full",26200,18.8,6.5,28900,6,6.5,29600,29.8,6.5,23100,5.0999999999999996,6.5,27500,22.2,6.5,17700,4.0999999999999996,6.5,"1-Stage","ECM - CA","2013-04-10"]
["McQuay","WGS","WGSV/WGSH030B*K","030","Full",30000,17.3,7.5,33600,5.8,7.5,33500,26.4,7.5,27600,5,7.5,31300,20.100000000000001,7.5,21600,4.0999999999999996,7.5,"1-Stage","ECM - CA","2013-04-10"]
["McQuay","WGS","WGSV/WGSH036B*K","036","Full",37300,19.2,9,40800,6,9,39700,28,9,33700,5.2,9,38500,22,9,26200,4.3,9,"1-Stage","ECM - CA","2013-04-10"]
["McQuay","WGS","WGSV/WGSH042B*K","042","Full",43900,17.5,10.5,48600,5.4,10.5,47500,26,10.5,40300,4.8,10.5,45500,20.2,10.5,31300,4,10.5,"1-Stage","ECM - CA","2013-04-10"]
["McQuay","WGS","WGSV/WGSH048B*K","048","Full",50500,17.2,12.2,57100,5.4,12.2,55700,25.8,12.2,47400,4.8,12.2,52700,19.899999999999999,12.2,36900,4,12.2,"1-Stage","ECM - CA","2013-04-10"]
["McQuay","WGS","WGSV/WGSH060B*K","060","Full",63700,17.399999999999999,16,74200,5.2,16,70000,25.5,16,59800,4.5999999999999996,16,66300,20,16,46500,3.8,16,"1-Stage","ECM - CA","2013-04-10"]
["McQuay","WGS","WGSV/WGSH070B*K","070","Full",73400,15.9,17.5,89000,5,17.5,79100,22.6,17.5,71900,4.4000000000000004,17.5,75700,18,17.5,55800,3.7,17.5,"1-Stage","ECM - CA","2013-04-10"]
["McQuay","WGT 2-stage","WGTV/WGTH026B*K","026","Full",26400,18,6.5,29300,5.7,6.5,29700,26.9,6.5,23400,5,6.5,27600,20.7,6.5,18100,4.0999999999999996,6.5,"2-Stage","ECM - CA","2013-04-10"]
["McQuay","WGT 2-stage","WGTV/WGTH032B*K","032","Full",32500,16.5,7.5,36400,5.3,7.5,35800,24,7.5,30100,4.8,7.5,33800,18.899999999999999,7.5,23700,4.0999999999999996,7.5,"2-Stage","ECM - CA","2013-04-10"]
["McQuay","WGT 2-stage","WGTV/WGTH038B*K","038","Full",39000,17.600000000000001,9,44400,5.6,9,42000,25.4,9,36200,5,9,40200,20.100000000000001,9,28100,4.2,9,"2-Stage","ECM - CA","2013-04-10"]
["McQuay","WGT 2-stage","WGTV/WGTH044B*K","044","Full",44400,17.3,10.5,50100,5.4,10.5,48300,25.4,10.5,40600,4.7,10.5,45900,19.8,10.5,31700,4,10.5,"2-Stage","ECM - CA","2013-04-10"]
["McQuay","WGT 2-stage","WGTV/WGTH049B*K","049","Full",48900,16.7,12.2,55300,5.3,12.2,53800,24.8,12.2,45900,4.7,12.2,50600,19.2,12.2,35900,4,12.2,"2-Stage","ECM - CA","2013-04-10"]
["McQuay","WGT 2-stage","WGTV/WGTH064B*K","064","Full",64800,17.399999999999999,16,76100,5.2,16,71000,24.7,16,60600,4.5999999999999996,16,67100,19.7,16,47000,3.9,16,"2-Stage","ECM - CA","2013-04-10"]
["McQuay","WGT 2-stage","WGTV/WGTH072B*K","072","Full",72700,15.9,17.5,88400,5,17.5,78900,22.6,17.5,70900,4.4000000000000004,17.5,75300,18.100000000000001,17.5,55200,3.7,17.5,"2-Stage","ECM - CA","2013-04-10"]
["McQuay","WLVC  WLVW","WLVC/WLVW*1*072*K","072","Full",72800,13.1,18.5,88500,4.5999999999999996,18.5,82800,19.7,18.5,74600,4.0999999999999996,18.5,74500,14.6,18.5,59100,3.4,18.5,"1-Stage","Belt Drive","2013-04-10"]
["McQuay","WLVC  WLVW","WLVC/WLVW*1*096*L","096","Full",86500,13,22.2,100800,4.7,22.2,97100,19.5,22.2,88700,4.3,22.2,89200,14.6,22.2,69700,3.6,22.2,"1-Stage","Belt Drive","2013-04-10"]
["McQuay","WLVC  WLVW","WLVC/WLVW*1*120*K","120","Full",119700,14,30,150200,5.3,30,133800,20.7,30,123700,4.7,30,123200,15.9,30,98000,3.9,30,"1-Stage","Belt Drive","2013-04-10"]
["McQuay","WLVC  WLVW","WLVC/WLVW*1*180*K","180","Full",189200,14.9,46,209800,4.9000000000000004,46,191200,16.100000000000001,46,132000,3.6,46,198200,19.7,46,171000,4.9000000000000004,46,"1-Stage","Belt Drive","2013-04-10"]
["McQuay","WLVC  WLVW","WLVC/WLVW*1*215*K","215","Full",220800,14.2,54,254800,4.9000000000000004,54,229200,16.3,54,147600,3.7,54,244700,21.5,54,196500,4.9000000000000004,54,"1-Stage","Belt Drive","2013-04-10"]
["McQuay","WLVC  WLVW","WLVC/WLVW*1*290*K","290","Full",308800,11,80,422100,4.0999999999999996,80,322400,12.4,80,260728,3.3,80,348100,16.2,80,343800,4.0999999999999996,80,"1-Stage","Belt Drive","2013-04-10"]
["McQuay","WMHC / WMHW","WMHC/WMHW1007*J","007","Full",8170,15.1,1.93,9430,5.0999999999999996,1.93,9510,24.6,1.93,7730,4.3,1.93,8560,17.7,1.93,6030,3.5,1.93,"1-Stage","PSC","2013-04-10"]
["McQuay","WMHC / WMHW","WMHC/WMHW1009*J","009","Full",9690,13.3,2.4300000000000002,11800,4.3,2.4300000000000002,11200,20.5,2.4300000000000002,9940,3.8,2.4300000000000002,10200,15.3,2.4300000000000002,7820,3.2,2.4300000000000002,"1-Stage","PSC","2013-04-10"]
["McQuay","WMHC / WMHW","WMHC/WMHW1012*J","012","Full",11600,13.5,2.9,14700,4.4000000000000004,2.9,13400,20.6,2.9,12200,3.9,2.9,12000,15,2.9,9530,3.3,2.9,"1-Stage","PSC","2013-04-10"]
["McQuay","WMHC / WMHW","WMHC/WMHW1015*J","015","Full",13700,12.5,3.7,18900,4.2,3.7,16100,18.899999999999999,3.7,15600,3.7,3.7,14600,14.2,3.7,12200,3.2,3.7,"1-Stage","PSC","2013-04-10"]
["McQuay","WMHC / WMHW","WMHC/WMHW1018*J","018","Full",16600,12.5,4.5999999999999996,22600,4.4000000000000004,4.5999999999999996,19500,19.399999999999999,4.5999999999999996,18600,4,4.5999999999999996,17800,14.7,4.5999999999999996,15500,3.6,4.5999999999999996,"1-Stage","PSC","2013-04-10"]
["McQuay","WRWA / WRGA","WRWA/WRGA*150",150,"Full",164390,14.9,31.3,198666,5.3,31.3,0,0,0,0,0,0,171048,16.8,31.3,128646,3.8,31.3,"1-Stage","Belt Drive","2014-04-15"]
["McQuay","WRWA / WRGA","WRWA/WRGA*180",180,"Full",199072,14.9,37.5,241608,5.2,37.5,0,0,0,0,0,0,206992,16.7,37.5,155900,4,37.5,"1-Stage","Belt Drive","2014-04-15"]
["McQuay","WRWA / WRGA","WRWA/WRGA*200",200,"Full",225066,15.8,41.7,264276,5.3,41.7,0,0,0,0,0,0,234082,17.7,41.7,167404,4,41.7,"1-Stage","Belt Drive","2014-04-15"]
["McQuay","WRWA / WRGA","WRWA/WRGA*210",210,"Full",222472,15.3,43.8,265856,5.5,43.8,0,0,0,0,0,0,231598,17.2,43.8,167484,4,43.8,"1-Stage","Belt Drive","2014-04-15"]
["McQuay","WRWA / WRGA","WRWA/WRGA*240",240,"Full",263654,16.399999999999999,50,298834,5.6,50,0,0,0,0,0,0,274346,18.5,50,190026,4.2,50,"1-Stage","Belt Drive","2014-04-15"]
["McQuay","WRWA / WRGA","WRWA/WRGA*300",300,"Full",358174,13.9,62.5,439652,4.9000000000000004,62.5,0,0,0,0,0,0,372950,15.6,62.5,285872,3.8,62.5,"1-Stage","Belt Drive","2014-04-15"]
["McQuay","WRWA / WRGA","WRWA/WRGA*360",360,"Full",414688,14.3,75,497222,4.9000000000000004,75,0,0,0,0,0,0,430604,15.9,75,315926,3.7,75,"1-Stage","Belt Drive","2014-04-15"]
["McQuay","WRWA / WRGA","WRWA/WRGA*420",420,"Full",477606,14.7,87.6,583648,5,87.6,0,0,0,0,0,0,496578,16.5,87.6,373286,3.8,87.6,"1-Stage","Belt Drive","2014-04-15"]
["McQuay","WRWC / WRGC","WRWC/WRGC*150",150,"Full",164390,14.9,31.3,198666,5.3,31.3,0,0,0,0,0,0,171048,16.8,31.3,128646,3.8,31.3,"1-Stage","Belt Drive","2014-04-15"]
["McQuay","WRWC / WRGC","WRWC/WRGC*180",180,"Full",199072,14.9,37.5,241608,5.2,37.5,0,0,0,0,0,0,206992,16.7,37.5,155900,4,37.5,"1-Stage","Belt Drive","2014-04-15"]
["McQuay","WRWC / WRGC","WRWC/WRGC*200",200,"Full",225066,15.8,41.7,264276,5.3,41.7,0,0,0,0,0,0,234082,17.7,41.7,167404,4,41.7,"1-Stage","Belt Drive","2014-04-15"]
["McQuay","WRWC / WRGC","WRWC/WRGC*210",210,"Full",222472,15.3,43.8,265856,5.5,43.8,0,0,0,0,0,0,231598,17.2,43.8,167484,4,43.8,"1-Stage","Belt Drive","2014-04-15"]
["McQuay","WRWC / WRGC","WRWC/WRGC*240",240,"Full",263654,16.399999999999999,50,298834,5.6,50,0,0,0,0,0,0,274346,18.5,50,190026,4.2,50,"1-Stage","Belt Drive","2014-04-15"]
["McQuay","WRWC / WRGC","WRWC/WRGC*300",300,"Full",358174,13.9,62.5,439652,4.9000000000000004,62.5,0,0,0,0,0,0,372950,15.6,62.5,285872,3.8,62.5,"1-Stage","Belt Drive","2014-04-15"]
["McQuay","WRWC / WRGC","WRWC/WRGC*360",360,"Full",414688,14.3,75,497222,4.9000000000000004,75,0,0,0,0,0,0,430604,15.9,75,315926,3.7,75,"1-Stage","Belt Drive","2014-04-15"]
["McQuay","WRWC / WRGC","WRWC/WRGC*420",420,"Full",477606,14.7,87.6,583648,5,87.6,0,0,0,0,0,0,496578,16.5,87.6,373286,3.8,87.6,"1-Stage","Belt Drive","2014-04-15"]
["McQuay","WVFC / WVFW","WVFC/WVFW1019****4","019","Full",19500,16.600000000000001,4.68,18000,4.5999999999999996,4.68,21600,26.1,4.68,16600,4.4000000000000004,4.68,19700,19,4.68,13400,3.7,4.68,"1-Stage","ECM - CA","2014-04-11"]
["McQuay","WVFC / WVFW","WVFC/WVFW1024****4","024","Full",24100,16.3,5.81,26300,5.2,5.81,26900,25.8,5.81,21300,4.5,5.81,25100,19.2,5.81,17500,3.8,5.81,"1-Stage","ECM - CA","2014-04-11"]
["McQuay","WVFC / WVFW","WVFC/WVFW1030****4","030","Full",29900,17,7.25,33400,5.4,7.25,32900,25.5,7.25,28400,4.8,7.25,30600,19.3,7.25,22300,4,7.25,"1-Stage","ECM - CA","2014-04-11"]
["McQuay","WVFC / WVFW","WVFC/WVFW1036****4","036","Full",39900,15,9.5,44500,4.5999999999999996,9.5,43000,21.3,9.5,37400,4,9.5,40500,16.600000000000001,9.5,30000,3.3,9.5,"1-Stage","ECM - CA","2014-04-11"]
["McQuay","WVFC / WVFW","WVFC/WVFW1042****4","042","Full",44200,16.2,11,52300,5.0999999999999996,11,49100,24.8,11,43000,4.5,11,46100,18.899999999999999,11,34400,3.8,11,"1-Stage","ECM - CA","2014-04-11"]
["McQuay","WVFC / WVFW","WVFC/WVFW1048****4","048","Full",48700,16,12,56400,5.0999999999999996,12,54300,23.8,12,47100,4.5,12,50200,18.2,12,37600,3.8,12,"1-Stage","ECM - CA","2014-04-11"]
["McQuay","WVFC / WVFW","WVFC/WVFW1060****4","060","Full",63600,15.7,15.5,67700,5,15.5,69900,22.9,15.5,57400,4.4000000000000004,15.5,66000,18,15.5,46000,3.8,15.5,"1-Stage","ECM - CA","2014-04-11"]
["McQuay","WVFC / WVFW","WVFC/WVFW1070****4","070","Full",76200,14,19,86300,4.5,19,80600,19.600000000000001,19,70500,4.0999999999999996,19,78400,16.2,19,56800,3.6,19,"1-Stage","ECM - CA","2014-04-11"]
["McQuay","WVFC / WVFW","WVFC/WVFW1009****1","009","Full",9060,14,2.2999999999999998,10600,4.7,2.2999999999999998,10900,23.8,2.2999999999999998,8820,4,2.2999999999999998,9720,16.7,2.2999999999999998,7020,3.3,2.2999999999999998,"1-Stage","PSC","2014-04-11"]
["McQuay","WVFC / WVFW","WVFC/WVFW1012****1","012","Full",12000,14.4,3,14000,4.8,3,14100,23.8,3,11800,4.2,3,12700,16.899999999999999,3,9300,3.5,3,"1-Stage","PSC","2014-04-11"]
["McQuay","WVFC / WVFW","WVFC/WVFW1015****1","015","Full",14700,16,3.6,16100,5.0999999999999996,3.6,17100,28.1,3.6,13100,4.3,3.6,15700,19.600000000000001,3.6,10000,3.5,3.6,"1-Stage","PSC","2014-04-11"]
["McQuay","WVFC / WVFW","WVFC/WVFW1019****1","019","Full",19200,15.2,4.7,18300,4.4000000000000004,4.7,21400,23.5,4.68,16900,4.0999999999999996,4.68,19400,17.3,4.68,13700,3.5,4.68,"1-Stage","PSC","2014-04-11"]
["McQuay","WVFC / WVFW","WVFC/WVFW1024****1","024","Full",23800,15.1,5.8,26700,4.9000000000000004,5.8,26600,23.3,5.81,21700,4.2,5.81,24800,14.9,5.81,17800,3.1,5.81,"1-Stage","PSC","2014-04-11"]
["McQuay","WVFC / WVFW","WVFC/WVFW1030****1","030","Full",30000,17,7.3,33400,5.2,7.3,33000,25.1,7.25,28400,4.5999999999999996,7.25,30700,19.100000000000001,7.25,22300,3.9,7.25,"1-Stage","PSC","2014-04-11"]
["McQuay","WVFC / WVFW","WVFC/WVFW1036****1","036","Full",39500,14.8,9.5,45000,4.5999999999999996,9.5,42900,22.3,9.5,37700,4.0999999999999996,9.5,40300,17.3,9.5,30300,3.4,9.5,"1-Stage","PSC","2014-04-11"]
["McQuay","WVFC / WVFW","WVFC/WVFW1042****1","042","Full",43900,15,11,52500,4.8,11,48800,22.1,11,42900,4.2,11,45400,17,11,35100,3.6,11,"1-Stage","PSC","2014-04-11"]
["McQuay","WVFC / WVFW","WVFC/WVFW1048****1","048","Full",48100,14.7,12,56800,4.8,12,56100,20.3,12,48900,4,12,51600,15.8,12,40300,3.4,12,"1-Stage","PSC","2014-04-11"]
["McQuay","WVFC / WVFW","WVFC/WVFW1060****1","060","Full",63200,15.1,15.5,68300,4.7,15.5,69000,20.5,15.5,58400,4.0999999999999996,15.5,65100,16.3,15.5,47000,3.5,15.5,"1-Stage","PSC","2014-04-11"]
["McQuay","WVFC / WVFW","WVFC/WVFW1070****1","070","Full",75400,13.5,19,87300,4.4000000000000004,19,79100,16.600000000000001,19,72700,3.6,19,76500,13.7,19,58900,3.1,19,"1-Stage","PSC","2014-04-11"]
["McQuay","WVHC","WVHC1021*J","021","Full",21500,14.5,5.4,26700,5.2,5.4,0,0,0,0,0,0,0,0,0,0,0,0,"1-Stage","ECM - CA","2014-04-11"]
["McQuay","WVHC","WVHC1024*J","024","Full",24400,15.4,6,29000,5,6,0,0,0,0,0,0,0,0,0,0,0,0,"1-Stage","ECM - CA","2014-04-11"]
["McQuay","WVHC","WVHC1030*J","030","Full",29100,15.4,7.3,35700,5,7.3,0,0,0,0,0,0,0,0,0,0,0,0,"1-Stage","ECM - CA","2014-04-11"]
["McQuay","WVHC","WVHC1036*J","036","Full",35400,14.2,9,44900,4.3,9,0,0,0,0,0,0,0,0,0,0,0,0,"1-Stage","ECM - CA","2014-04-11"]
["McQuay","WVHC","WVHC1009*J","009","Full",9800,14.4,2.5,11000,5,2.5,0,0,0,0,0,0,0,0,0,0,0,0,"1-Stage","PSC","2014-04-11"]
["McQuay","WVHC","WVHC1012*J","012","Full",11700,13.6,3,14700,5.2,3,0,0,0,0,0,0,0,0,0,0,0,0,"1-Stage","PSC","2014-04-11"]
["McQuay","WVHC","WVHC1015*J","015","Full",14000,14.5,3.5,18100,5,3.5,0,0,0,0,0,0,0,0,0,0,0,0,"1-Stage","PSC","2014-04-11"]
["McQuay","WVHC","WVHC1018*J","018","Full",16800,13.6,4.2,21200,4.3,4.2,0,0,0,0,0,0,0,0,0,0,0,0,"1-Stage","PSC","2014-04-11"]
["McQuay","WVHC","WVHC1021*J","021","Full",21500,14.2,5.4,26700,5.0999999999999996,5.4,0,0,0,0,0,0,0,0,0,0,0,0,"1-Stage","PSC","2014-04-11"]
["McQuay","WVHC","WVHC1024*J","024","Full",24400,15.1,6,29000,4.9000000000000004,6,0,0,0,0,0,0,0,0,0,0,0,0,"1-Stage","PSC","2014-04-11"]
["McQuay","WVHC","WVHC1030*J","030","Full",29100,15.2,7.3,35700,4.9000000000000004,7.3,0,0,0,0,0,0,0,0,0,0,0,0,"1-Stage","PSC","2014-04-11"]
["McQuay","WVHC","WVHC1036*J","036","Full",35400,14.1,9,44900,4.3,9,0,0,0,0,0,0,0,0,0,0,0,0,"1-Stage","PSC","2014-04-11"]
["McQuay","WWCA","WWCA1036*L","036","Full",33200,12.1,9,0,0,0,39000,18.7,9,0,0,0,32500,13,9,0,0,0,"1-Stage","NA","2014-04-11"]
["McQuay","WWCA","WWCA1048*L","048","Full",41000,14.3,12,0,0,0,47500,21.8,12,0,0,0,40000,15.3,12,0,0,0,"1-Stage","NA","2014-04-11"]
["McQuay","WWCA","WWCA1060*L","060","Full",45000,12.9,13.5,0,0,0,52500,19.7,13.5,0,0,0,44000,13.8,13.5,0,0,0,"1-Stage","NA","2014-04-11"]
["McQuay","WWCA","WWCA1072*L","072","Full",60000,12.6,17,0,0,0,70000,18.899999999999999,17,0,0,0,58500,13.3,17,0,0,0,"1-Stage","NA","2014-04-11"]
["McQuay","WWCA","WWCA1120*L","120","Full",91500,13.4,24,0,0,0,107000,20.6,24,0,0,0,89500,14.4,24,0,0,0,"1-Stage","NA","2014-04-11"]
["McQuay","WWCA","WWCA1150*L","150","Full",118500,12.9,30,0,0,0,"NDA","NDA","NDA",0,0,0,116500,13.8,30,0,0,0,"1-Stage","NA","2014-04-11"]
["McQuay","WWCA","WWCA1180*L","180","Full","NDA","NDA","NDA","NDA","NDA","NDA","NDA","NDA","NDA","NDA","NDA","NDA","NDA","NDA","NDA","NDA","NDA","NDA","1-Stage","NA","2014-04-11"]
["McQuay","WWCA","WWCA1240*L","240","Full","NDA","NDA","NDA","NDA","NDA","NDA","NDA","NDA","NDA","NDA","NDA","NDA","NDA","NDA","NDA","NDA","NDA","NDA","1-Stage","NA","2014-04-11"]
["McQuay","WWCA","WWCA1300*L","300","Full","NDA","NDA","NDA","NDA","NDA","NDA","NDA","NDA","NDA","NDA","NDA","NDA","NDA","NDA","NDA","NDA","NDA","NDA","1-Stage","NA","2014-04-11"]
["McQuay","WWCA","WWCA1360*L","360","Full","NDA","NDA","NDA","NDA","NDA","NDA","NDA","NDA","NDA","NDA","NDA","NDA","NDA","NDA","NDA","NDA","NDA","NDA","1-Stage","NA","2014-04-11"]
["McQuay","WWCA","WWCA1420*L","420","Full","NDA","NDA","NDA","NDA","NDA","NDA","NDA","NDA","NDA","NDA","NDA","NDA","NDA","NDA","NDA","NDA","NDA","NDA","1-Stage","NA","2014-04-11"]
["McQuay","WWHA","WWHA1036*L","036","Full",0,0,0,47500,4.5,9,0,0,0,39500,3.7,9,0,0,0,31200,2.9,9,"1-Stage","NA","2014-04-11"]
["McQuay","WWHA","WWHA1048*L","048","Full",0,0,0,57000,4.5999999999999996,12,0,0,0,47500,3.8,12,0,0,0,37500,3,12,"1-Stage","NA","2014-04-11"]
["McQuay","WWHA","WWHA1060*L","060","Full",0,0,0,66000,4.5,13.5,0,0,0,55000,3.7,13.5,0,0,0,43500,2.9,13.5,"1-Stage","NA","2014-04-11"]
["McQuay","WWHA","WWHA1072*L","072","Full",0,0,0,84000,4.3,17,0,0,0,70500,3.6,17,0,0,0,56000,2.9,17,"1-Stage","NA","2014-04-11"]
["McQuay","WWHA","WWHA1120*L","120","Full",0,0,0,126500,4.4000000000000004,24,0,0,0,105500,3.6,24,0,0,0,83500,2.9,24,"1-Stage","NA","2014-04-11"]
["McQuay","WWHA","WWHA1150*L","150","Full",0,0,0,167500,4.7,30,0,0,0,139500,3.9,30,0,0,0,110500,3.1,30,"1-Stage","NA","2014-04-11"]
["McQuay","WWHA","WWHA1180*L","180","Full","NDA","NDA","NDA","NDA","NDA","NDA","NDA","NDA","NDA","NDA","NDA","NDA","NDA","NDA","NDA","NDA","NDA","NDA","1-Stage","NA","2014-04-11"]
["McQuay","WWHA","WWHA1240*L","240","Full","NDA","NDA","NDA","NDA","NDA","NDA","NDA","NDA","NDA","NDA","NDA","NDA","NDA","NDA","NDA","NDA","NDA","NDA","1-Stage","NA","2014-04-11"]
["McQuay","WWHA","WWHA1300*L","300","Full","NDA","NDA","NDA","NDA","NDA","NDA","NDA","NDA","NDA","NDA","NDA","NDA","NDA","NDA","NDA","NDA","NDA","NDA","1-Stage","NA","2014-04-11"]
["McQuay","WWHA","WWHA1360*L","360","Full","NDA","NDA","NDA","NDA","NDA","NDA","NDA","NDA","NDA","NDA","NDA","NDA","NDA","NDA","NDA","NDA","NDA","NDA","1-Stage","NA","2014-04-11"]
["McQuay","WWHA","WWHA1420*L","420","Full","NDA","NDA","NDA","NDA","NDA","NDA","NDA","NDA","NDA","NDA","NDA","NDA","NDA","NDA","NDA","NDA","NDA","NDA","1-Stage","NA","2014-04-11"]
["McQuay","WWRA","WWRA1036*L","036","Full",33200,12.1,9,47500,4.5,9,39000,18.7,9,39500,3.7,9,32500,13,9,31200,2.9,9,"1-Stage","NA","2014-04-11"]
["McQuay","WWRA","WWRA1048*L","048","Full",41000,14.3,12,57000,4.5999999999999996,12,47500,21.8,12,47500,3.8,12,40000,15.3,12,37500,3,12,"1-Stage","NA","2014-04-11"]
["McQuay","WWRA","WWRA1060*L","060","Full",45000,12.9,13.5,66000,4.5,13.5,52500,19.7,13.5,55000,3.7,13.5,44000,13.8,13.5,43500,2.9,13.5,"1-Stage","NA","2014-04-11"]
["McQuay","WWRA","WWRA1072*L","072","Full",60000,12.6,17,84000,4.3,17,70000,18.899999999999999,17,70500,3.6,17,58500,13.3,17,56000,2.9,17,"1-Stage","NA","2014-04-11"]
["McQuay","WWRA","WWRA1120*L","120","Full",91500,13.4,24,126500,4.4000000000000004,24,107000,20.6,24,105500,3.6,24,89500,14.4,24,83500,2.9,24,"1-Stage","NA","2014-04-11"]
["McQuay","WWRA","WWRA1150*L","150","Full",118500,12.9,30,167500,4.7,30,"NDA","NDA","NDA",139500,3.9,30,116500,13.8,30,110500,3.1,30,"1-Stage","NA","2014-04-11"]
["McQuay","WWRA","WWRA1180*L","180","Full","NDA","NDA","NDA","NDA","NDA","NDA","NDA","NDA","NDA","NDA","NDA","NDA","NDA","NDA","NDA","NDA","NDA","NDA","1-Stage","NA","2014-04-11"]
["McQuay","WWRA","WWRA1240*L","240","Full","NDA","NDA","NDA","NDA","NDA","NDA","NDA","NDA","NDA","NDA","NDA","NDA","NDA","NDA","NDA","NDA","NDA","NDA","1-Stage","NA","2014-04-11"]
["McQuay","WWRA","WWRA1300*L","300","Full","NDA","NDA","NDA","NDA","NDA","NDA","NDA","NDA","NDA","NDA","NDA","NDA","NDA","NDA","NDA","NDA","NDA","NDA","1-Stage","NA","2014-04-11"]
["McQuay","WWRA","WWRA1360*L","360","Full","NDA","NDA","NDA","NDA","NDA","NDA","NDA","NDA","NDA","NDA","NDA","NDA","NDA","NDA","NDA","NDA","NDA","NDA","1-Stage","NA","2014-04-11"]
["McQuay","WWRA","WWRA1420*L","420","Full","NDA","NDA","NDA","NDA","NDA","NDA","NDA","NDA","NDA","NDA","NDA","NDA","NDA","NDA","NDA","NDA","NDA","NDA","1-Stage","NA","2014-04-11"]
["Rittling","VHC","VHC1A","009","Full",9200,13.5,2.6,12500,4.7,2.6,11200,21,3,10500,4.0999999999999996,3,9700,15.6,2.8,8100,3.4,2.8,"1-Stage","PSC","2013-04-10"]
["Rittling","VHC","VHC2A","012","Full",12000,13,3.6,16000,4.5999999999999996,3.6,14800,21,3.9,13500,4,3.9,13200,15.5,3.7,10000,3.3,3.7,"1-Stage","PSC","2013-04-10"]
["Rittling","VHC","VHC3A","015","Full",16500,13,4.9000000000000004,21500,4.5,4.9000000000000004,19500,20,5.4,18500,3.9,5.4,18000,15,5.0999999999999996,15000,3.2,5.0999999999999996,"1-Stage","PSC","2013-04-10"]
["Rittling","VHC","VHC4A","018","Full",18500,13,5.3,23500,4.5,5.3,20500,19.5,5.7,19500,3.9,5.7,19000,14.8,5.5,16800,3.2,5.5,"1-Stage","PSC","2013-04-10"]
["Rittling","VHC","VHC5A","024","Full",22500,13,6.6,29500,4.7,6.6,26800,20,7.1,24500,4.2,7.1,24000,15,6.8,19000,3.3,6.8,"1-Stage","PSC","2013-04-10"]
["Rittling","VHC","VHC6A","030","Full",30000,12.7,8.6999999999999993,37000,4.5,8.6999999999999993,35000,19,9.6,32000,4,9.6,32000,14.5,9.1999999999999993,25000,3.3,9.1999999999999993,"1-Stage","PSC","2013-04-10"]
["Rittling","VHC","VHC7A","036","Full",34000,13,9.4,41000,4.5,9.4,38000,19,10.4,35000,4,10.4,36000,15,9.9,27000,3.2,9.9,"1-Stage","PSC","2013-04-10"]
["Trane","DXH 2-stage","DXHF024","024","Full",26200,17.7,5.6,31700,5.4,5.6,29100,26,5.6,25600,4.7,5.6,27400,20.399999999999999,5.6,18700,3.8,5.6,"2-Stage","ECM - CA","2014-05-08"]
["Trane","DXH 2-stage","DXHF036","036","Full",37400,16.3,8.4,47500,5.0999999999999996,8.4,41800,24.1,8.4,39500,4.7,8.4,39100,18.7,8.4,29200,3.8,8.4,"2-Stage","ECM - CA","2014-05-08"]
["Trane","DXH 2-stage","DXHF048","048","Full",51200,17.2,11.2,62400,5.4,11.2,56600,24.7,11.2,50800,4.8,11.2,53000,19.5,11.2,38800,3.9,11.2,"2-Stage","ECM - CA","2014-05-08"]
["Trane","DXH 2-stage","DXHF060","060","Full",59300,15.1,14,82000,5.0999999999999996,14,66800,20.9,14,67400,4.5999999999999996,14,62100,17.2,14,50800,3.8,14,"2-Stage","ECM - CA","2014-05-08"]
["Trane","DXH 2-stage","DXHF070","070","Full",67800,15.5,15.4,88300,4.9000000000000004,15.4,74100,22.1,15.4,72700,4.5,15.4,70400,17.600000000000001,15.4,56800,3.8,15.4,"2-Stage","ECM - CA","2014-05-08"]
["Trane","DXV 2-stage","DXVF024","024","Full",25700,17.7,5.6,31300,5.3,5.6,28000,25.8,5.6,25400,4.9000000000000004,5.6,26400,20.2,5.6,19300,4,5.6,"2-Stage","ECM - CA","2014-05-08"]
["Trane","DXV 2-stage","DXVF036","036","Full",37200,16.600000000000001,8.4,47100,5.0999999999999996,8.4,40700,24.1,8.4,38800,4.7,8.4,38400,19.100000000000001,8.4,30200,4,8.4,"2-Stage","ECM - CA","2014-05-08"]
["Trane","DXV 2-stage","DXVF048","048","Full",49500,17.100000000000001,11.2,61100,5.5,11.2,54200,24.8,11.2,50400,4.9000000000000004,11.2,51100,19.399999999999999,11.2,39300,4.0999999999999996,11.2,"2-Stage","ECM - CA","2014-05-08"]
["Trane","DXV 2-stage","DXVF060","060","Full",59800,16.100000000000001,14,79000,5.3,14,65700,22.7,14,65400,4.8,14,62100,18.2,14,51100,4,14,"2-Stage","ECM - CA","2014-05-08"]
["Trane","DXV 2-stage","DXVF070","070","Full",68300,15.6,15.4,90300,4.9000000000000004,15.4,74600,22.5,15.4,75000,4.5,15.4,70700,17.8,15.4,58500,3.9,15.4,"2-Stage","ECM - CA","2014-05-08"]
["Trane","EXH","EXH0067","006","Full",7600,15,1.8,8800,4.9000000000000004,1.8,8800,23.4,1.8,7600,4.4000000000000004,1.8,8000,17.399999999999999,1.8,5700,3.4,1.8,"1-Stage","ECM - CA","2014-04-11"]
["Trane","EXH","EXH0097","009","Full",9000,14.9,2.1,11100,5.4,2.1,10000,21.9,2.1,9100,4.7,2.1,9400,16.899999999999999,2.1,7000,3.8,2.1,"1-Stage","ECM - CA","2014-04-11"]
["Trane","EXH","EXH0127","012","Full",11900,15.5,2.8,14600,5.2,2.8,14000,26.6,2.8,11900,4.5,2.8,12700,18.8,2.8,9000,3.6,2.8,"1-Stage","ECM - CA","2014-04-11"]
["Trane","EXH","EXH0157","015","Full",15100,15.3,3.5,18300,4.8,3.5,17500,25,3.5,15200,4.2,3.5,15900,17.899999999999999,3.5,11300,3.4,3.5,"1-Stage","ECM - CA","2014-04-11"]
["Trane","EXH","EXHF0187","018","Full",19300,16.7,4.2,23300,5.0999999999999996,4.2,20600,25,4.2,19100,4.5,4.2,19800,18.7,4.2,14200,3.6,4.2,"1-Stage","ECM - CA","2014-04-11"]
["Trane","EXH","EXHF0247","024","Full",23800,16,5.6,27700,4.8,5.6,25900,23.8,5.6,24100,4.5,5.6,24700,18,5.6,18800,3.6,5.6,"1-Stage","ECM - CA","2014-04-11"]
["Trane","EXH","EXHF0307","030","Full",30500,16.8,7,36200,5.4,7,33700,24.3,7,29600,4.5999999999999996,7,31600,18.7,7,22700,3.7,7,"1-Stage","ECM - CA","2014-04-11"]
["Trane","EXH","EXHF0368","036","Full",35200,17,8.4,44400,5.4,8.4,39700,25.8,8.4,36500,4.8,8.4,36700,19.100000000000001,8.4,28200,3.8,8.4,"1-Stage","ECM - CA","2014-04-11"]
["Trane","EXH","EXHF0428","042","Full",42500,16.8,9.8000000000000007,52400,5.3,9.8000000000000007,45800,23.3,9.8000000000000007,43100,4.7,9.8000000000000007,43700,18.5,9.8000000000000007,34200,3.9,9.8000000000000007,"1-Stage","ECM - CA","2014-04-11"]
["Trane","EXH","EXHF0488","048","Full",47800,16.100000000000001,11.2,60000,5.3,11.2,52000,22.8,11.2,48800,4.7,11.2,49100,17.7,11.2,38000,3.9,11.2,"1-Stage","ECM - CA","2014-04-11"]
["Trane","EXH","EXHF0608","060","Full",58600,15,14,77800,4.9000000000000004,14,64700,22,14,64100,4.4000000000000004,14,61400,17.100000000000001,14,50400,3.8,14,"1-Stage","ECM - CA","2014-04-11"]
["Trane","EXH","EXHF0708","070","Full",66600,15.5,15.4,82100,4.5,15.4,70900,21.1,15.4,68900,4.0999999999999996,15.4,68500,16.899999999999999,15.4,52600,3.3,15.4,"1-Stage","ECM - CA","2014-04-11"]
["Trane","EXV","EXV0067","006","Full",7700,15.7,1.8,9200,5.3,1.8,9000,24.2,1.8,7900,4.7,1.8,8300,18.3,1.8,6200,3.8,1.8,"1-Stage","ECM - CA","2014-04-11"]
["Trane","EXV","EXV0097","009","Full",9000,14.9,2.1,11100,5.5,2.1,10200,22.7,2.1,9300,4.8,2.1,9500,17.3,2.1,7200,3.9,2.1,"1-Stage","ECM - CA","2014-04-11"]
["Trane","EXV","EXV0127","012","Full",12400,16.3,2.8,15100,5.4,2.8,14200,26.9,2.8,12400,4.7,2.8,13100,19.3,2.8,9400,3.9,2.8,"1-Stage","ECM - CA","2014-04-11"]
["Trane","EXV","EXV0157","015","Full",15300,15.6,3.5,18900,5,3.5,17500,25.4,3.5,15700,4.5,3.5,16100,18.3,3.5,12000,3.7,3.5,"1-Stage","ECM - CA","2014-04-11"]
["Trane","EXV","EXVF0187","018","Full",19000,16.399999999999999,4.2,23700,5.4,4.2,20600,24.4,4.2,19300,4.7,4.2,19700,18.399999999999999,4.2,14400,3.7,4.2,"1-Stage","ECM - CA","2014-04-11"]
["Trane","EXV","EXVF0247","024","Full",24600,16.7,5.6,29000,5.2,5.6,26700,25.2,5.6,24800,4.7,5.6,25500,18.899999999999999,5.6,19200,3.8,5.6,"1-Stage","ECM - CA","2014-04-11"]
["Trane","EXV","EXVF0307","030","Full",30100,17.399999999999999,7,35900,5.7,7,33000,25.1,7,29000,4.8,7,31100,19.3,7,22500,3.9,7,"1-Stage","ECM - CA","2014-04-11"]
["Trane","EXV","EXVF0368","036","Full",34800,16.8,8.4,44800,5.5,8.4,38600,24.4,8.4,36600,4.9000000000000004,8.4,36000,18.600000000000001,8.4,28000,3.8,8.4,"1-Stage","ECM - CA","2014-04-11"]
["Trane","EXV","EXVF0428","042","Full",42200,16.7,9.8000000000000007,51100,5.2,9.8000000000000007,45400,23.4,9.8000000000000007,42300,4.5999999999999996,9.8000000000000007,43400,18.5,9.8000000000000007,33400,3.9,9.8000000000000007,"1-Stage","ECM - CA","2014-04-11"]
["Trane","EXV","EXVF0488","048","Full",47500,16.5,11.2,57500,5.3,11.2,51700,24,11.2,48200,4.9000000000000004,11.2,49000,18.5,11.2,37800,4.0999999999999996,11.2,"1-Stage","ECM - CA","2014-04-11"]
["Trane","EXV","EXVF0608","060","Full",59700,15.5,14,79800,5.0999999999999996,14,64900,22,14,64600,4.5,14,62400,17.399999999999999,14,50400,3.9,14,"1-Stage","ECM - CA","2014-04-11"]
["Trane","EXV","EXVF0708","070","Full",66700,15.9,15.4,83000,4.7,15.4,70500,21.8,15.4,69000,4.2,15.4,68600,17.5,15.4,52300,3.4,15.4,"1-Stage","ECM - CA","2014-04-11"]
["Trane","EXW","EXWE0608","060","Full",52100,13.4,12.5,74100,4.3,12.5,56900,20.6,12.5,60900,3.6,12.5,54000,15.5,12.5,48100,2.8,12.5,"1-Stage","NA","2013-04-10"]
["Trane","EXW","EXWE1208","120","Full",105100,13.2,25,139400,3.9,25,118700,20.8,25,118400,3.3,25,110100,15.5,25,95300,2.6,25,"1-Stage","NA","2013-04-10"]
["Trane","EXW","EXWE2408","240","Full",192300,13.5,50,262700,4.0999999999999996,50,221300,20.6,50,224200,3.6,50,204000,15.7,50,172600,2.8,50,"1-Stage","NA","2013-04-10"]
["Trane","GEC","GECE0067","006","Full",7500,12.5,1.8,9400,4.9000000000000004,1.8,8500,18.54,1.8,7900,4.2,1.8,7800,14.42,1.8,6100,3.3,1.8,"1-Stage","PSC","2013-04-10"]
["Trane","GEC","GECE0097","009","Full",8800,13.1,2.1,10900,5.0999999999999996,2.1,9900,18.100000000000001,2.1,9500,4.3,2.1,9100,14.6,2.1,7100,3.4,2.1,"1-Stage","PSC","2013-04-10"]
["Trane","GEC","GECE0127","012","Full",11500,13.5,2.8,14600,4.9000000000000004,2.8,12800,19.7,2.8,11900,4.0999999999999996,2.8,11900,15.1,2.8,9500,3.4,2.8,"1-Stage","PSC","2013-04-10"]
["Trane","GEC","GECE0157","015","Full",14700,13.7,3.5,17900,4.8,3.5,16100,20,3.5,14800,4.0999999999999996,3.5,15300,15.7,3.5,12000,3.4,3.5,"1-Stage","PSC","2013-04-10"]
["Trane","GEC","GECE0187","018","Full",16500,13.4,4.2,20800,4.8,4.2,17700,18.899999999999999,4.2,17000,4.0999999999999996,4.2,16900,14.7,4.2,13400,3.3,4.2,"1-Stage","PSC","2013-04-10"]
["Trane","GEH","GEHE0728","072","Full",75500,13.4,18,83800,4.8,18,83200,21.9,18,69100,4.2,18,74600,16,18,54400,3.5,18,"1-Stage","Belt Drive","2013-04-10"]
["Trane","GEH","GEHE0908","090","Full",88100,14.1,22.5,99200,4.68,22.5,94600,20.67,22.5,83000,4.07,22.5,88100,15.8,22.5,64500,3.4,22.5,"1-Stage","Belt Drive","2013-04-10"]
["Trane","GEH","GEHE1208","120","Full",115900,13.35,30,147100,4.5999999999999996,30,129000,19.3,30,122600,4.0999999999999996,30,120600,14.9,30,99200,3.2,30,"1-Stage","Belt Drive","2013-04-10"]
["Trane","GEH","GEHE1508","150","Full",152800,14.3,37.5,175000,4.4000000000000004,37.5,166800,20.6,37.5,147800,4.0999999999999996,37.5,158000,16.399999999999999,37.5,118000,3.4,37.5,"1-Stage","Belt Drive","2013-04-10"]
["Trane","GEH","GEHE1808","180","Full",180800,13.1,45,222700,4.4000000000000004,45,204700,18.5,45,183100,4,45,188500,14.7,45,147900,3.5,45,"1-Stage","Belt Drive","2013-04-10"]
["Trane","GEH","GEHE0067","006","Full",7500,12.6,1.8,9300,4.5999999999999996,1.8,8600,18.36,1.8,7900,4,1.8,7900,14.1,1.8,6000,3.3,1.8,"1-Stage","PSC","2013-04-10"]
["Trane","GEH","GEHE0097","009","Full",8800,13,2.1,11300,4.9000000000000004,2.1,10100,18,2.1,9300,4.2,2.1,9300,14.5,2.1,7200,3.4,2.1,"1-Stage","PSC","2013-04-10"]
["Trane","GEH","GEHE0127","012","Full",11700,14,2.8,14600,4.9000000000000004,2.8,12700,20,2.8,12000,4.2,2.8,12000,15.4,2.8,9300,3.4,2.8,"1-Stage","PSC","2013-04-10"]
["Trane","GEH","GEHE0157","015","Full",14300,13.5,3.5,18300,4.5,3.5,15800,20.6,3.5,15300,4,3.5,14800,15.4,3.5,12100,3.3,3.5,"1-Stage","PSC","2013-04-10"]
["Trane","GEH","GEHE0187","018","Full",18000,13.3,4.2,21900,4.8,4.2,19500,19.5,4.2,18100,4.2,4.2,18500,14.9,4.2,14300,3.4,4.2,"1-Stage","PSC","2013-04-10"]
["Trane","GEH","GEHE0248","024","Full",24000,14.4,5.6,29700,4.7,5.6,26800,21.8,5.6,24900,4.2,5.6,25100,16.8,5.6,19300,3.4,5.6,"1-Stage","PSC","2013-04-10"]
["Trane","GEH","GEHE0308","030","Full",28200,13.8,7,35700,4.5999999999999996,7,32000,20.399999999999999,7,29800,4.0999999999999996,7,29500,15.7,7,22800,3.4,7,"1-Stage","PSC","2013-04-10"]
["Trane","GEH","GEHE0368","036","Full",35200,14.2,8.4,44100,4.5999999999999996,8.4,39400,21.6,8.4,36000,4.0999999999999996,8.4,36600,16.3,8.4,28200,3.3,8.4,"1-Stage","PSC","2013-04-10"]
["Trane","GEH","GEHE0428","042","Full",41500,13.6,9.8000000000000007,51900,4.5999999999999996,9.8000000000000007,45900,19.5,9.8000000000000007,42900,4,9.8000000000000007,43100,15.4,9.8000000000000007,34100,3.4,9.8000000000000007,"1-Stage","PSC","2013-04-10"]
["Trane","GEH","GEHE0488","048","Full",49700,13.9,11.2,58200,4.8,11.2,55700,20.6,11.2,49300,4.2,11.2,51800,15.9,11.2,38700,3.6,11.2,"1-Stage","PSC","2013-04-10"]
["Trane","GEH","GEHE0608","060","Full",59700,13.4,14,70500,4.5,14,66200,19.3,14,58000,4,14,62200,15.4,14,46400,3.4,14,"1-Stage","PSC","2013-04-10"]
["Trane","GER","GERE0368","036","Full",38200,14.6,8.4,41400,4.5,8.4,43800,23.9,8.4,36100,4.2,8.4,40000,17.600000000000001,8.4,29800,3.6,8.4,"1-Stage","Belt Drive","2013-04-10"]
["Trane","GER","GERE0488","048","Full",51500,15.8,11.2,52700,4.7,11.2,58000,24.3,11.2,45500,4.3,11.2,53500,18.399999999999999,11.2,37900,3.6,11.2,"1-Stage","Belt Drive","2013-04-10"]
["Trane","GER","GERE0608","060","Full",60900,14.6,14,69500,4.7,14,69200,22.4,14,59200,4.2,14,63500,16.899999999999999,14,47900,3.6,14,"1-Stage","Belt Drive","2013-04-10"]
["Trane","GER","GERE0728","072","Full",75500,13.7,18.600000000000001,85200,4.3,18.600000000000001,83800,19.600000000000001,18.600000000000001,71100,4,18.600000000000001,78500,15.6,18.600000000000001,57700,3.4,18.600000000000001,"1-Stage","Belt Drive","2013-04-10"]
["Trane","GER","GERE0908","090","Full",86600,13,23.3,105400,4.4000000000000004,23.3,95500,18,23.3,86500,4,23.3,90600,14.6,23.3,70200,3.5,23.3,"1-Stage","Belt Drive","2013-04-10"]
["Trane","GER","GERE1208","120","Full",133100,15.9,31,143200,4.9000000000000004,31,153700,24.9,31,116900,4.2,31,140200,18.5,31,85800,3.3,31,"1-Stage","Belt Drive","2013-04-10"]
["Trane","GER","GERE1508","150","Full",160300,15.9,38.799999999999997,181500,5.0999999999999996,38.799999999999997,178700,22.7,38.799999999999997,150800,4.5,38.799999999999997,166800,18,38.799999999999997,118800,3.7,38.799999999999997,"1-Stage","Belt Drive","2013-04-10"]
["Trane","GER","GERE1808","180","Full",184400,14.2,46.5,201000,4.5999999999999996,46.5,204200,19.7,46.5,162900,4,46.5,192500,15.9,46.5,123200,3.2,46.5,"1-Stage","Belt Drive","2013-04-10"]
["Trane","GER","GERE2408","240","Full",261600,13.2,62,313100,4.4000000000000004,62,290500,17.7,62,265900,4,62,273500,14.8,62,210000,3.5,62,"1-Stage","Belt Drive","2013-04-10"]
["Trane","GER","GERE3008","300","Full",290100,13.1,77.5,313100,16.600000000000001,77.5,299500,14.3,77.5,"NDA","NDA","NDA","NDA","NDA","NDA","NDA","NDA","NDA","1-Stage","Belt Drive","2013-04-10"]
["Trane","GET","GETE0097","009","Full",8200,12.8,2.1,10800,4.5999999999999996,2.1,9700,18.399999999999999,2.1,8700,3.8,2.1,8800,14.9,2.1,6600,3.2,2.1,"1-Stage","PSC","2014-04-15"]
["Trane","GET","GETE0097","009","Full",8300,13.9,2.1,10500,4.5999999999999996,2.1,9600,21.1,2.1,8500,3.9,2.1,8700,16.2,2.1,6500,3.2,2.1,"1-Stage","PSC","2014-04-15"]
["Trane","GET","GETE0127","012","Full",11900,13.5,2.8,14100,4.5999999999999996,2.8,13100,18.899999999999999,2.8,11800,4,2.8,12300,15.1,2.8,9000,3.2,2.8,"1-Stage","PSC","2014-04-15"]
["Trane","GET","GETE0127","012","Full",12000,14.2,2.8,14300,4.8,2.8,14100,23.2,2.8,11600,4,2.8,12600,16.5,2.8,8700,3.2,2.8,"1-Stage","PSC","2014-04-15"]
["Trane","GET","GETE0157","015","Full",14700,13.1,3.5,17700,4.5999999999999996,3.5,16600,20.100000000000001,3.5,13700,3.7,3.5,15400,14.8,3.5,11800,3.3,3.5,"1-Stage","PSC","2014-04-15"]
["Trane","GET","GETE0157","015","Full",14900,15,3.5,18000,5,3.5,17000,23.9,3.5,14800,4.3,3.5,15600,17.5,3.5,11300,3.5,3.5,"1-Stage","PSC","2014-04-15"]
["Trane","GET","GETE0187","018","Full",18100,13,4.2,22900,4.5,4.2,19500,18,4.2,17900,3.7,4.2,18700,14.3,4.2,14800,3.3,4.2,"1-Stage","PSC","2014-04-15"]
["Trane","GET","GETE0187","018","Full",18500,14.6,4.2,22300,4.5999999999999996,4.2,21100,22.6,4.2,18400,4.2,4.2,19500,17,4.2,14200,3.4,4.2,"1-Stage","PSC","2014-04-15"]
["Trane","GET","GETE0247","024","Full",23300,13.1,5.6,26600,4.3,5.6,25600,18.600000000000001,5.6,23600,3.9,5.6,24300,14.9,5.6,18700,3.2,5.6,"1-Stage","PSC","2014-04-15"]
["Trane","GET","GETE0247","024","Full",24200,16,5.6,26300,4.8,5.6,26800,24,5.6,23100,4.4000000000000004,5.6,25200,18.399999999999999,5.6,17800,3.5,5.6,"1-Stage","PSC","2014-04-15"]
["Trane","GET","GETE0367","036","Full",33700,13,8.4,41300,4.3,8.4,37900,18.7,8.4,34400,3.7,8.4,35100,14.6,8.4,27300,3.2,8.4,"1-Stage","PSC","2014-04-15"]
["Trane","GET","GETE0367","036","Full",34200,15.2,8.4,40200,4.5999999999999996,8.4,38200,24,8.4,33500,4.0999999999999996,8.4,35600,17.8,8.4,26300,3.3,8.4,"1-Stage","PSC","2014-04-15"]
["Trane","GEV","GEVE0728","072","Full",74900,15.24,18,82800,4.6399999999999997,18,84800,22.85,18,25,70200,18,4.18,78800,17.5,18,54500,3.44,"1-Stage","Belt Drive","2013-04-10"]
["Trane","GEV","GEVE0908","090","Full",89700,15.1,22.5,103600,4.5,22.5,98600,22.91,22.5,22.9,83600,22.5,4.0999999999999996,92100,17.399999999999999,22.5,65600,3.4,"1-Stage","Belt Drive","2013-04-10"]
["Trane","GEV","GEVE1208","120","Full",119300,14.54,30,134300,4.5,30,131400,21.05,30,23.5,113900,30,4.0599999999999996,123200,16.600000000000001,30,90400,3.4,"1-Stage","Belt Drive","2013-04-10"]
["Trane","GEV","GEVE1508","150","Full",154300,15.4,37.5,185300,4.8,37.5,170400,22.2,37.5,22.2,152900,37.5,4.3,158900,17.3,37.5,120600,3.6,"1-Stage","Belt Drive","2013-04-10"]
["Trane","GEV","GEVE1808","180","Full",185700,14.1,45,221500,4.4000000000000004,45,205000,20.100000000000001,45,20.100000000000001,180400,45,4.0999999999999996,192200,16.100000000000001,45,143500,3.5,"1-Stage","Belt Drive","2013-04-10"]
["Trane","GEV","GEVE2408","240","Full",249800,15.1,60,270800,4.5999999999999996,60,280200,22.1,60,22.1,223800,60,4.2,258000,17,60,177900,3.5,"1-Stage","Belt Drive","2013-04-10"]
["Trane","GEV","GEVE3008","300","Full",305700,13.9,75,350400,4.3,75,339400,19.5,75,19.5,286400,75,3.8,315500,15.7,75,234600,3.3,"1-Stage","Belt Drive","2013-04-10"]
["Trane","GEV","GEVE0067","006","Full",7600,12.81,1.8,9500,4.8,1.8,8500,18.899999999999999,1.8,8000,4.0999999999999996,1.8,7800,14.81,1.8,6200,3.3,1.8,"1-Stage","PSC","2013-04-10"]
["Trane","GEV","GEVE0097","009","Full",8800,13,2.1,11300,5.0999999999999996,2.1,10000,18.100000000000001,2.1,9300,4.3,2.1,9100,14.6,2.1,7200,3.5,2.1,"1-Stage","PSC","2013-04-10"]
["Trane","GEV","GEVE0127","012","Full",11600,14,2.8,14900,5,2.8,12800,20.8,2.8,12200,4.3,2.8,12000,15.8,2.8,9400,3.5,2.8,"1-Stage","PSC","2013-04-10"]
["Trane","GEV","GEVE0157","015","Full",14400,13.8,3.5,18300,4.9000000000000004,3.5,15900,21.3,3.5,15000,4.2,3.5,14800,15.6,3.5,11700,3.5,3.5,"1-Stage","PSC","2013-04-10"]
["Trane","GEV","GEVE0187","018","Full",17800,13.1,4.2,22200,4.8,4.2,19400,19.2,4.2,18400,4.0999999999999996,4.2,18300,14.7,4.2,14500,3.5,4.2,"1-Stage","PSC","2013-04-10"]
["Trane","GEV","GEVE0248","024","Full",24700,14.7,5.6,29500,4.8,5.6,26900,22.4,5.6,24600,4.3,5.6,25500,17,5.6,19500,3.5,5.6,"1-Stage","PSC","2013-04-10"]
["Trane","GEV","GEVE0308","030","Full",28800,14.4,7,34900,4.9000000000000004,7,31900,21.6,7,29300,4.3,7,29900,16.5,7,23200,3.6,7,"1-Stage","PSC","2013-04-10"]
["Trane","GEV","GEVE0368","036","Full",36300,15,8.4,46200,5,8.4,40100,22.8,8.4,38100,4.4000000000000004,8.4,37600,17.2,8.4,30100,3.5,8.4,"1-Stage","PSC","2013-04-10"]
["Trane","GEV","GEVE0428","042","Full",41000,13.9,9.8000000000000007,51700,4.7,9.8000000000000007,45900,20.5,9.8000000000000007,42800,4.0999999999999996,9.8000000000000007,43100,16,9.8000000000000007,33800,3.5,9.8000000000000007,"1-Stage","PSC","2013-04-10"]
["Trane","GEV","GEVE0488","048","Full",49500,14.1,11.2,51400,4.5999999999999996,11.2,55200,20.9,11.2,43000,4,11.2,51300,16.2,11.2,34200,3.4,11.2,"1-Stage","PSC","2013-04-10"]
["Trane","GEV","GEVE0608","060","Full",61600,14,14,71700,4.8,14,67600,20,14,58600,4.2,14,64100,15.9,14,46800,3.5,14,"1-Stage","PSC","2013-04-10"]
["Trane","TCT 2-stage","TCT026**4","026","Full",25600,15.7,9,30400,5.4,9,29000,24,8,25300,5,8,27000,18.399999999999999,8,18900,4.0999999999999996,8,"2-Stage","ECM - CA","2013-04-10"]
["Trane","TCT 2-stage","TCT038**4","038","Full",38600,17.100000000000001,9,41800,5.5,9,39400,24,9,34700,4.9000000000000004,9,40000,19.8,9,26600,4.0999999999999996,9,"2-Stage","ECM - CA","2013-04-10"]
["Trane","TCT 2-stage","TCT049**4","049","Full",47900,15.8,12,57000,5.0999999999999996,12,53000,22.6,12,47000,4.7,12,49600,18,12,37300,4,12,"2-Stage","ECM - CA","2013-04-10"]
["Trane","TCT 2-stage","TCT064**4","064","Full",64100,16,16,72100,5,16,70700,22.2,16,56200,4.5,16,67600,17.8,16,45400,3.8,16,"2-Stage","ECM - CA","2013-04-10"]
["Trane","TCT 2-stage","TCT072**4","072","Full",71000,14.9,18,86400,5,18,79200,20.100000000000001,18,67500,4.3,18,73000,16.8,18,54000,3.7,18,"2-Stage","ECM - CA","2013-04-10"]
["Trane","VSH Variable Speed","VSH024","024","Full",25100,18.3,6.2,30300,6.44,6.2,28400,31.76,6.2,24300,5.33,6.2,26200,21.82,6.2,18500,4.3499999999999996,6.2,"Variable","ECM - CA","2014-04-11"]
["Trane","VSH Variable Speed","VSH033","033","Full",33800,15.79,8.6,40200,5.85,8.6,37900,25.01,8.6,32300,4.9800000000000004,8.6,35300,18.510000000000002,8.6,24700,4.0999999999999996,8.6,"Variable","ECM - CA","2014-04-11"]
["Trane","VSH Variable Speed","VSH042","042","Full",42600,18.600000000000001,10.5,51800,6.7,10.5,47300,30.9,10.5,42000,5.6,10.5,44600,22,10.5,31500,4.5,10.5,"Variable","ECM - CA","2014-04-11"]
["Trane","VSH Variable Speed","VSH050","050","Full",50200,16.5,12.7,64400,5.8,12.7,56200,26,12.7,52500,5.0999999999999996,12.7,52400,19.3,12.7,40100,4.2,12.7,"Variable","ECM - CA","2014-04-11"]
["Trane","VSH Variable Speed","VSH060","060","Full",60700,14.8,15.6,81600,5.3,15.6,67300,22.8,15.6,66800,4.7,15.6,63200,17,15.6,50400,3.8,15.6,"Variable","ECM - CA","2014-04-11"]
["Trane","VSV Variable Speed","VSV024","024","Full",24600,18.440000000000001,6.2,30300,6.1,6.2,27800,33.24,6.2,24400,5.2,6.2,25900,22.32,6.2,18400,4.17,6.2,"Variable","ECM - CA","2014-04-11"]
["Trane","VSV Variable Speed","VSV033","033","Full",32900,15.47,8.3000000000000007,40400,5.46,8.3000000000000007,36600,24.67,8.3000000000000007,32400,4.7699999999999996,8.3000000000000007,34300,18.079999999999998,8.3000000000000007,24500,3.86,8.3000000000000007,"Variable","ECM - CA","2014-04-11"]
["Trane","VSV Variable Speed","VSV042","042","Full",44100,18.25,10.9,54700,5.95,10.9,50100,32.46,10.9,43600,5.08,10.9,46200,22.03,10.9,31900,3.98,10.9,"Variable","ECM - CA","2014-04-11"]
["Trane","VSV Variable Speed","VSV050","050","Full",51200,15.72,13,68800,5.32,13,57800,26.19,13,54600,4.58,13,54100,18.760000000000002,13,41400,3.75,13,"Variable","ECM - CA","2014-04-11"]
["Trane","VSV Variable Speed","VSV060","060","Full",61800,15.6,15.6,81200,5.5,15.6,70400,25.4,15.6,65400,4.8,15.6,64600,18.3,15.6,50000,4,15.6,"Variable","ECM - CA","2014-04-11"]
["Waterfurnace","LCC","LCC/LCW/LCS/LCX09*2","009","Full",8700,11.8,2.5,11400,4.3,2.5,10000,18.600000000000001,2.5,9200,3.6,2.5,0,0,0,0,0,0,"1-Stage","PSC","2013-04-10"]
["Waterfurnace","LCC","LCC/LCW/LCS/LCX12*2","012","Full",10900,11.5,3.5,14700,4.2,3.5,12700,17.899999999999999,3.5,118200,3.6,3.5,0,0,0,0,0,0,"1-Stage","PSC","2013-04-10"]
["Waterfurnace","NB","NBV/NBH015**2*4","015","Full",14400,16.5,4,18500,5.3,4,16700,27,4,15500,4.7,4,15000,18.8,4,12000,4,4,"1-Stage","ECM - CA","2013-04-10"]
["Waterfurnace","NB","NBV/NBH018**2*4","018","Full",18000,16.5,5,23000,5.3,5,21000,26.8,5,19000,4.7,5,18500,19,5,14700,4.0999999999999996,5,"1-Stage","ECM - CA","2013-04-10"]
["Waterfurnace","NB","NBV/NBH024**4*4","024","Full",24800,17,8,30000,5.3,8,28100,27.5,8,24600,4.5999999999999996,8,26000,19.600000000000001,8,19000,3.8,8,"1-Stage","ECM - CA","2013-04-10"]
["Waterfurnace","NB","NBV/NBH030**4*4","030","Full",27800,19.2,8,30600,5.7,8,31200,29.5,8,24400,4.8,8,29400,21.9,8,20000,4,8,"1-Stage","ECM - CA","2013-04-10"]
["Waterfurnace","NB","NBV/NBH036**4*4","036","Full",34900,21.6,9,34200,6,9,38000,30.1,9,28200,5.0999999999999996,9,35400,22.4,9,24100,4.4000000000000004,9,"1-Stage","ECM - CA","2013-04-10"]
["Waterfurnace","NB","NBV/NBH042**4*4","042","Full",40800,20,11,42800,5.7,11,46200,29.5,11,35000,4.9000000000000004,11,42000,21.8,11,27500,4.2,11,"1-Stage","ECM - CA","2013-04-10"]
["Waterfurnace","NB","NBV/NBH048**4*4","048","Full",47300,18.5,12,53100,5.4,12,53000,26.1,12,43400,4.7,12,49300,20.100000000000001,12,35000,3.9,12,"1-Stage","ECM - CA","2013-04-10"]
["Waterfurnace","NB","NBV/NBH060**4*4","060","Full",61300,16.600000000000001,15,69000,5.3,15,69000,24.7,15,57000,4.7,15,65500,19.2,15,45000,4,15,"1-Stage","ECM - CA","2013-04-10"]
["Waterfurnace","NB","NBV/NBH070**4*4","070","Full",67000,15.4,18,81800,5,18,77400,23.8,18,67000,4.4000000000000004,18,70600,18,18,52500,3.7,18,"1-Stage","ECM - CA","2013-04-10"]
["Waterfurnace","NB","NBV/NBH009**2*0","009","Full",9600,14.5,3,13200,5.2,3,10800,22.2,3,10600,4.4000000000000004,3,9800,16.7,3,7800,3.4,3,"1-Stage","PSC","2013-04-10"]
["Waterfurnace","NB","NBV/NBH012**2*0","012","Full",12300,15.7,3.5,14800,5.0999999999999996,3.5,14500,25.5,3.5,12300,4.5,3.5,13000,18,3.5,9600,3.7,3.5,"1-Stage","PSC","2013-04-10"]
["Waterfurnace","NB","NBV/NBH015**2*0","015","Full",14400,15.9,4,18500,5.0999999999999996,4,16700,26,4,15500,4.5,4,15000,18,4,12000,3.8,4,"1-Stage","PSC","2013-04-10"]
["Waterfurnace","NB","NBV/NBH018**2*0","018","Full",18000,15.6,5,23000,5.0999999999999996,5,21000,25.5,5,19000,4.4000000000000004,5,18500,18,5,14700,3.8,5,"1-Stage","PSC","2013-04-10"]
["Waterfurnace","NB","NBV/NBH024**4*0","024","Full",24800,16.2,8,29000,5,8,28100,24,8,23900,4.3,8,26000,19.2,8,18900,3.7,8,"1-Stage","PSC","2013-04-10"]
["Waterfurnace","NB","NBV/NBH030**4*0","030","Full",27600,18.2,8,30600,5.4,8,30800,27.1,8,24400,4.7,8,29200,21.1,8,19800,3.8,8,"1-Stage","PSC","2013-04-10"]
["Waterfurnace","NB","NBV/NBH036**4*0","036","Full",34100,17.600000000000001,9,34200,5.6,9,36300,25.7,9,28200,4.7,9,34600,19.600000000000001,9,24100,4,9,"1-Stage","PSC","2013-04-10"]
["Waterfurnace","NB","NBV/NBH042**5*0","042","Full",40100,16.600000000000001,11,42800,5.0999999999999996,11,44600,24.5,11,34900,4.3,11,41600,18.600000000000001,11,27500,3.7,11,"1-Stage","PSC","2013-04-10"]
["Waterfurnace","NB","NBV/NBH048**5*0","048","Full",46400,15.5,12,53100,4.9000000000000004,12,51600,22.5,12,43400,4.2,12,48900,17.3,12,35000,3.6,12,"1-Stage","PSC","2013-04-10"]
["Waterfurnace","NB","NBV/NBH060**5*0","060","Full",61300,15.4,15,69000,5,15,68700,23.2,15,55100,4.4000000000000004,15,65500,18.2,15,43200,3.7,15,"1-Stage","PSC","2013-04-10"]
["Waterfurnace","NB","NBV/NBH070**5*0","070","Full",67000,14.5,18,81800,4.5999999999999996,18,75900,21.6,18,66100,4,18,70600,17,18,52000,3.4,18,"1-Stage","PSC","2013-04-10"]
["Waterfurnace","NB 2-stage","NBV/NBH026**4*4","026","Full",26000,17.3,8,30300,5.5,8,29000,24,8,25100,5,8,27700,20.399999999999999,8,19500,4.3,8,"2-Stage","ECM - CA","2013-04-10"]
["Waterfurnace","NB 2-stage","NBV/NBH038**4*4","038","Full",39000,18,9,40300,5.4,9,39400,24.1,9,33600,4.8,9,40200,21,9,26700,4.0999999999999996,9,"2-Stage","ECM - CA","2013-04-10"]
["Waterfurnace","NB 2-stage","NBV/NBH049**4*4","049","Full",50300,17.100000000000001,12,56100,5.2,12,56200,24.5,12,46300,4.5999999999999996,12,52000,20,12,37400,4,12,"2-Stage","ECM - CA","2013-04-10"]
["Waterfurnace","NB 2-stage","NBV/NBH064**4*4","064","Full",62000,16.3,16,70600,5.2,16,70100,23.9,16,58000,4.7,16,65100,18.7,16,47100,4,16,"2-Stage","ECM - CA","2013-04-10"]
["Waterfurnace","NB 2-stage","NBV/NBH072**4*4","072","Full",69000,15,18,81900,4.8,18,78500,22,18,67500,4.3,18,71600,17,18,54200,3.7,18,"2-Stage","ECM - CA","2013-04-10"]
["Waterfurnace","NCC","NCC/NCW/NCS/NCE09*2","009","Full",8500,13.4,2.5,10500,4.4000000000000004,2.5,10200,22.5,2.5,8700,3.8,2.5,9000,16,2.5,6700,3.1,2.5,"1-Stage","PSC","2013-04-10"]
["Waterfurnace","NCC","NCC/NCW/NCS/NCE12*2","012","Full",10500,12.3,3.5,14400,4.3,3.5,12400,19.5,3.5,11800,3.7,3.5,11000,14.2,3.5,9500,3.5,3.5,"1-Stage","PSC","2013-04-10"]
["Waterfurnace","NCC","NCC/NCW/NCS/NCE15*2","015","Full",13500,13.6,4.5,17000,4.9000000000000004,4.5,16200,22,4.5,14000,4.0999999999999996,4.5,14200,15.9,4.5,10500,3.4,4.5,"1-Stage","PSC","2013-04-10"]
["Waterfurnace","NCC","NCC/NCW/NCS/NCE18*2","018","Full",16200,12.5,5.5,21000,4.4000000000000004,5.5,19000,19.600000000000001,5.5,17000,3.7,5.5,16600,15.1,5.5,13300,3.1,5.5,"1-Stage","PSC","2013-04-10"]
["Waterfurnace","ND 2-stage","NDV/NDH026**4*1","026","Full",26000,16,8,31000,5.5,8,29000,24,8,25300,5,8,27200,18.600000000000001,8,19500,4.2,8,"2-Stage","ECM - CA","2014-04-11"]
["Waterfurnace","ND 2-stage","NDV/NDH026G1*4","026","Full",26000,17.3,8,30300,5.5,8,29000,24,8,25100,5,8,27700,20.399999999999999,8,19500,4.3,8,"2-Stage","ECM - CA","2014-04-11"]
["Waterfurnace","ND 2-stage","NDV/NDH038**4*1","038","Full",39000,17.2,9,42200,5.5,9,39400,24.1,9,34800,5,9,40200,20.100000000000001,9,27000,4.2,9,"2-Stage","ECM - CA","2014-04-11"]
["Waterfurnace","ND 2-stage","NDV/NDH038G1*4","038","Full",39000,18,9,40300,5.4,9,39400,24.1,9,33600,4.8,9,40200,21,9,26700,4.0999999999999996,9,"2-Stage","ECM - CA","2014-04-11"]
["Waterfurnace","ND 2-stage","NDV/NDH049**4*1","049","Full",48300,15.8,12,57400,5.0999999999999996,12,53200,22.7,12,47200,4.7,12,50000,18,12,37400,4.0999999999999996,12,"2-Stage","ECM - CA","2014-04-11"]
["Waterfurnace","ND 2-stage","NDV/NDH049G1*4","049","Full",50300,17.100000000000001,12,56100,5.2,12,56200,24.5,12,46300,4.5999999999999996,12,52000,20,12,37400,4,12,"2-Stage","ECM - CA","2014-04-11"]
["Waterfurnace","ND 2-stage","NDV/NDH064**4*1","064","Full",64500,16.2,16,72500,5.0999999999999996,16,70700,22.7,16,56800,4.5999999999999996,16,67600,18,16,45800,3.9,16,"2-Stage","ECM - CA","2014-04-11"]
["Waterfurnace","ND 2-stage","NDV/NDH064G1*4","064","Full",62000,16.3,16,70600,5.2,16,70100,23.9,16,58000,4.7,16,65100,18.7,16,47100,4,16,"2-Stage","ECM - CA","2014-04-11"]
["Waterfurnace","ND 2-stage","NDV/NDH072**4*1","072","Full",71000,15,18,86700,5,18,79900,20.399999999999999,18,67900,4.4000000000000004,18,73600,16.8,18,54100,3.8,18,"2-Stage","ECM - CA","2014-04-11"]
["Waterfurnace","ND 2-stage","NDV/NDH072G1*4","072","Full",69000,15,18,81900,4.8,18,78500,22,18,67500,4.3,18,71600,17,18,54200,3.7,18,"2-Stage","ECM - CA","2014-04-11"]
["Waterfurnace","NDW 2-stage","NDW100*5","100","Full",93000,14.6,23,125000,4,23,105000,22,23,103000,3.3,23,100000,16.8,23,82000,3,23,"2-Stage","NA","2013-04-10"]
["Waterfurnace","NDW 2-stage","NDW120*5","120","Full",103000,14,28,142000,4,28,123000,21.6,28,118000,3.3,28,114000,16.2,28,93000,3,28,"2-Stage","NA","2013-04-10"]
["Waterfurnace","NDW 2-stage","NDW150*5","150","Full",129000,13.5,32,199000,4,32,153000,21.1,32,148000,3.2,32,147000,16,32,123000,2.8,32,"2-Stage","NA","2013-04-10"]
["Waterfurnace","NDW 2-stage","NDW180*5","180","Full",150000,13.3,36,221000,3.9,36,175000,19.8,36,173000,3.1,36,165000,15.8,36,139000,2.7,36,"2-Stage","NA","2013-04-10"]
["Waterfurnace","NL / NX","NLH/NXH080**5","080","Full",73000,15.5,22,77700,4.7,22,79000,22.5,22,65800,4.2,22,76000,17.7,22,51300,3.5,22,"1-Stage","Belt Drive","2013-04-10"]
["Waterfurnace","NL / NX","NLH/NXH095**5","095","Full",85500,15.6,24,91000,4.8,24,95000,23,24,78000,4.3,24,91200,18.100000000000001,24,61600,3.5,24,"1-Stage","Belt Drive","2013-04-10"]
["Waterfurnace","NL / NX","NLH/NXH120**5","120","Full",113000,13.8,28,140600,4.5999999999999996,28,129000,21.9,28,115000,4.0999999999999996,28,119500,16.2,28,89000,3.4,28,"1-Stage","Belt Drive","2013-04-10"]
["Waterfurnace","NL / NX","NLV/NXV080T*5","080","Full",76000,16.5,22,85000,5,22,84000,24.2,22,71000,4.4000000000000004,22,83000,19.7,22,55000,3.7,22,"1-Stage","Belt Drive","2013-04-10"]
["Waterfurnace","NL / NX","NLV/NXV095T*5","095","Full",91000,17.2,24,100000,5.2,24,101000,25.7,24,83000,4.5999999999999996,24,95000,19.600000000000001,24,65000,3.8,24,"1-Stage","Belt Drive","2013-04-10"]
["Waterfurnace","NL / NX","NLV/NXV120T*5","120","Full",115000,15.5,28,136000,5.0999999999999996,28,135000,24.3,28,107500,4.4000000000000004,28,122000,18,28,83000,3.6,28,"1-Stage","Belt Drive","2013-04-10"]
["Waterfurnace","NL / NX","NLV/NXV160T*5","160","Full",166000,18.899999999999999,null,154000,5.0999999999999996,null,178000,25.3,null,130000,4.5999999999999996,null,171000,21,null,97000,3.7,null,"1-Stage","Belt Drive","2013-04-10"]
["Waterfurnace","NL / NX","NLV/NXV180T*5","180","Full",180000,17.100000000000001,null,190000,5,null,187000,22.2,null,149000,4.3,null,185000,18.5,null,109000,3.4,null,"1-Stage","Belt Drive","2013-04-10"]
["Waterfurnace","NL / NX","NLV/NXV240T*5","240","Full",240000,16.3,null,296000,5.2,null,264000,22.5,null,237000,4.5999999999999996,null,246000,17.399999999999999,null,184000,3.8,null,"1-Stage","Belt Drive","2013-04-10"]
["Waterfurnace","NL / NX","NLV/NXV300T*5","300","Full",284000,17.3,null,353000,5.4,null,314000,24.5,null,286000,4.8,null,291000,19,null,224000,4.2,null,"1-Stage","Belt Drive","2013-04-10"]
["Waterfurnace","NSW","NSW018*1","018","Full",16400,14,5,22200,4.5,5,18800,22.9,5,18500,3.7,5,17300,16.600000000000001,5,14700,3.1,5,"1-Stage","NA","2013-04-10"]
["Waterfurnace","NSW","NSW025*4","025","Full",23700,13.6,7,32800,4.5999999999999996,7,26700,21.2,7,27100,3.8,7,24700,16.100000000000001,7,22000,3.1,7,"1-Stage","NA","2013-04-10"]
["Waterfurnace","NSW","NSW040*5","040","Full",35900,15.5,10,47900,4.8,10,40900,23.4,10,39100,3.9,10,37700,17.5,10,30500,3.1,10,"1-Stage","NA","2013-04-10"]
["Waterfurnace","NSW","NSW050*5","050","Full",49800,13.9,15,65000,4.4000000000000004,15,55600,21.6,15,54200,3.7,15,51500,16.399999999999999,15,44200,3.1,15,"1-Stage","NA","2013-04-10"]
["Waterfurnace","NSW","NSW060*5","060","Full",55400,13.6,18,78000,4.7,18,62500,20.6,18,63200,3.8,18,58000,16.100000000000001,18,50100,3.1,18,"1-Stage","NA","2013-04-10"]
["Waterfurnace","NSW","NSW075*5","075","Full",66000,12.3,19,93100,4.2,19,74100,18,19,77100,3.5,19,68400,14,19,61500,2.9,19,"1-Stage","NA","2013-04-10"]
["Waterfurnace","NXW 2-stage","NXW096*5","096","Full",93000,14.6,23,125000,4,23,105000,22,23,103000,3.3,23,100000,16.8,23,82000,2.8,23,"2-Stage","NA","2013-04-10"]
["Waterfurnace","NXW 2-stage","NXW108*5","108","Full",103000,14,28,142000,4,28,123000,21.6,28,118000,3.3,28,114000,16.2,28,93000,3,28,"2-Stage","NA","2013-04-10"]
["Waterfurnace","NXW 2-stage","NXW120*5","120","Full",128000,13.8,32,175000,3.8,32,151000,21,32,145000,3.2,32,139000,16,32,115000,2.8,32,"2-Stage","NA","2013-04-10"]
["Waterfurnace","NXW 2-stage","NXW140*5","140","Full",143000,14.5,36,193000,4.2,36,166000,22.5,36,160000,3.8,36,155000,17,36,127000,3.1,36,"2-Stage","NA","2013-04-10"]
["Waterfurnace","NXW 2-stage","NXW180*5","180","Full",170000,14,45,209000,3.9,45,183000,20,45,189000,3.5,45,177000,15.8,45,153000,2.8,45,"2-Stage","NA","2013-04-10"]
["Waterfurnace","NXW 2-stage","NXW210*5","210","Full",202000,14.8,52,257000,4.2,52,227000,21.8,52,219000,3.8,52,212000,17,52,173000,3.1,52,"2-Stage","NA","2013-04-10"]
["Waterfurnace","NXW 2-stage","NXW240*5","240","Full",222000,13.3,60,286000,3.9,60,257000,20,60,244000,3.5,60,242000,15.5,60,193000,2.8,60,"2-Stage","NA","2013-04-10"]
["Waterfurnace","NXW 2-stage","NXW360*5","360","Full",335000,14.3,86,452600,4.3,86,"NA","NA","NA","NA","NA","NA",351000,16.2,86,296500,3.2,86,"2-Stage","NA","2013-04-10"]
["Waterfurnace","NXW 2-stage","NXW540*5","540","Full",533400,14.5,135,691200,4.3,135,"NA","NA","NA","NA","NA","NA",558500,16.399999999999999,135,485800,3.3,135,"2-Stage","NA","2013-04-10"]
["Waterfurnace","UB","UBV/UBH015**2*4","015","Full",13800,13.2,4,16100,4.5999999999999996,4,16000,21,4,13400,4.0999999999999996,4,14200,15.7,4,11000,3.3,4,"1-Stage","ECM - CA","2014-04-14"]
["Waterfurnace","UB","UBV/UBH018**2*4","018","Full",17300,14.2,5,19000,4.5,5,19800,22,5,16000,3.9,5,18000,16.2,5,12600,3.3,5,"1-Stage","ECM - CA","2014-04-14"]
["Waterfurnace","UB","UBV/UBH024**4*4","024","Full",22900,13.6,6,26000,4.7,6,27000,20.8,6,22600,4.2,6,24500,15.6,6,17000,3.5,6,"1-Stage","ECM - CA","2014-04-14"]
["Waterfurnace","UB","UBV/UBH030**4*4","030","Full",28400,14.7,8,34000,4.7,8,33500,22.5,8,28000,4.2,8,30000,17,8,21000,3.5,8,"1-Stage","ECM - CA","2014-04-14"]
["Waterfurnace","UB","UBV/UBH036**4*4","036","Full",34500,14.5,9,43800,4.9000000000000004,9,40000,23,9,35600,4.4000000000000004,9,36000,17,9,26000,3.5,9,"1-Stage","ECM - CA","2014-04-14"]
["Waterfurnace","UB","UBV/UBH042**4*4","042","Full",39200,14.2,11,51000,4.9000000000000004,11,47000,22,11,41400,4.5,11,42000,16.600000000000001,11,30500,3.5,11,"1-Stage","ECM - CA","2014-04-14"]
["Waterfurnace","UB","UBV/UBH048**4*4","048","Full",47200,14,12,59000,4.8,12,57000,21,12,48000,4.2,12,49500,16,12,36500,3.5,12,"1-Stage","ECM - CA","2014-04-14"]
["Waterfurnace","UB","UBV/UBH060**4*4","060","Full",57000,14,15,66000,4.5999999999999996,15,67000,22,15,55000,4.2,15,58000,16,15,43000,3.5,15,"1-Stage","ECM - CA","2014-04-14"]
["Waterfurnace","UB","UBV/UBH070**4*4","070","Full",66000,14.6,18,80000,4.7,18,75000,22,18,64000,4.2,18,68000,16.600000000000001,18,49000,3.5,18,"1-Stage","ECM - CA","2014-04-14"]
["Waterfurnace","UB","UBV/UBH006**9*0","006","Full",7100,13.4,2,8000,4.3,2,8400,21.3,2,6800,3.8,2,7400,15.5,2,5400,3.2,2,"1-Stage","PSC","2014-04-14"]
["Waterfurnace","UB","UBV/UBH009**9*0","009","Full",8100,12.2,3,11400,4.5999999999999996,3,9900,19.2,3,9600,4,3,8900,14.5,3,7600,3.4,3,"1-Stage","PSC","2014-04-14"]
["Waterfurnace","UB","UBV/UBH012**9*0","012","Full",10200,12.2,3,15200,4.4000000000000004,3,12200,18.2,3,12600,3.9,3,11200,14.2,3,10200,3.5,3,"1-Stage","PSC","2014-04-14"]
["Waterfurnace","UB","UBV/UBH015**2*0","015","Full",13200,12.5,4,15400,4.5,4,16000,20,4,13000,4,4,14000,15.3,4,10400,3.2,4,"1-Stage","PSC","2014-04-14"]
["Waterfurnace","UB","UBV/UBH018**2*0","018","Full",17300,13.4,5,19000,4.3,5,19800,20.5,5,16000,3.7,5,18000,15.4,5,12600,3.2,5,"1-Stage","PSC","2014-04-14"]
["Waterfurnace","UB","UBV/UBH024**4*0","024","Full",22900,13,6,26000,4.5,6,27000,19.8,6,22600,4,6,24500,14.8,6,17000,3.3,6,"1-Stage","PSC","2014-04-14"]
["Waterfurnace","UB","UBV/UBH030**4*0","030","Full",28400,13.8,8,34000,4.5,8,33500,21,8,28000,4,8,30000,16,8,21000,3.3,8,"1-Stage","PSC","2014-04-14"]
["Waterfurnace","UB","UBV/UBH036**4*0","036","Full",34500,14,9,43800,4.7,9,40000,22,9,35600,4.2,9,36000,16.3,9,26000,3.3,9,"1-Stage","PSC","2014-04-14"]
["Waterfurnace","UB","UBV/UBH042**5*0","042","Full",39200,13.2,11,51000,4.7,11,47000,20.399999999999999,0,41400,4.3,11,42000,15.2,11,30500,3.3,11,"1-Stage","PSC","2014-04-14"]
["Waterfurnace","UB","UBV/UBH048**5*0","048","Full",47200,13,12,59000,4.5999999999999996,12,57000,19.8,12,48000,4,12,49500,15,12,36500,3.3,12,"1-Stage","PSC","2014-04-14"]
["Waterfurnace","UB","UBV/UBH060**5*0","060","Full",57000,13.5,15,66000,4.3,15,67000,21,15,55000,4,15,58000,15.2,15,43000,3.3,15,"1-Stage","PSC","2014-04-14"]
["Waterfurnace","UB","UBV/UBH070**5*0","070","Full",66000,14,18,80000,4.5,18,75000,20.5,18,64000,4,18,68000,15.6,18,49000,3.3,18,"1-Stage","PSC","2014-04-14"]
["Waterfurnace","US","USH023**4*4","023","Full",23000,15,6,26000,4.7,6,25400,23,6,21900,4.3,6,23900,17,6,17000,3.6,6,"1-Stage","ECM - CA","2014-04-14"]
["Waterfurnace","US","USV/USH015**2*4","015","Full",14000,15.3,4,16500,4.9000000000000004,4,16000,24.3,4,15000,4.4000000000000004,4,14700,17.5,4,11500,3.7,4,"1-Stage","ECM - CA","2014-04-14"]
["Waterfurnace","US","USV/USH018**2*4","018","Full",17600,15.2,5,21000,4.8,5,20600,24,5,17500,4.4000000000000004,5,18500,17.5,5,13700,3.7,5,"1-Stage","ECM - CA","2014-04-14"]
["Waterfurnace","US","USV/USH024**4*4","024","Full",23900,15.1,6,27000,5,6,26400,23.4,6,22300,4.5,6,24400,17.5,6,17500,3.8,6,"1-Stage","ECM - CA","2014-04-14"]
["Waterfurnace","US","USV/USH030**4*4","030","Full",29500,15.7,8,34600,5.0999999999999996,8,32900,23.9,8,28300,4.4000000000000004,8,29000,18.3,8,22800,3.8,8,"1-Stage","ECM - CA","2014-04-14"]
["Waterfurnace","US","USV/USH036**4*4","036","Full",33300,15,9,40600,4.8,9,37700,23,9,33000,4.3,9,34500,17.3,9,26000,3.6,9,"1-Stage","ECM - CA","2014-04-14"]
["Waterfurnace","US","USV/USH042**4*4","042","Full",40800,15.6,11,45400,5,11,45800,23.5,11,37000,4.3,11,42300,18.5,11,29900,3.7,11,"1-Stage","ECM - CA","2014-04-14"]
["Waterfurnace","US","USV/USH048**4*4","048","Full",47700,15.5,12,56000,4.8,12,52000,23.4,12,45900,4.2,12,49500,18.100000000000001,12,36900,3.6,12,"1-Stage","ECM - CA","2014-04-14"]
["Waterfurnace","US","USV/USH060**4*4","060","Full",58400,15.3,15,72500,4.7,15,65500,23,15,58400,4.0999999999999996,15,60900,17.899999999999999,15,47100,3.6,15,"1-Stage","ECM - CA","2014-04-14"]
["Waterfurnace","US","USV/USH070**4*4","070","Full",63000,14.3,18,79000,4.7,18,70000,21.1,18,64100,4.0999999999999996,18,68500,17.100000000000001,18,51600,3.6,18,"1-Stage","ECM - CA","2014-04-14"]
["Waterfurnace","US","USV041**4*4","041","Full",40000,14.5,11,45000,4.5,11,44500,22,11,36000,4,11,41000,16.5,11,29000,3.5,11,"1-Stage","ECM - CA","2014-04-14"]
["Waterfurnace","US","USH023**4*0","023","Full",23000,14.5,6,26000,4.5,6,25400,22.5,6,21900,3.9,6,23900,16.8,6,17000,3.4,6,"1-Stage","PSC","2014-04-14"]
["Waterfurnace","US","USV/USH009**2*0","009","Full",8500,12,3,11500,4.4000000000000004,3,10500,18.2,3,9600,3.7,3,9100,13.5,3,7600,3,3,"1-Stage","PSC","2014-04-14"]
["Waterfurnace","US","USV/USH012**2*0","012","Full",10900,12.7,3.5,14700,4.4000000000000004,3.5,12500,18.2,3.5,12000,3.8,3.5,11500,14.7,3.5,9600,3.2,3.5,"1-Stage","PSC","2014-04-14"]
["Waterfurnace","US","USV/USH015**2*0","015","Full",14000,15,4,16500,4.8,4,16000,24,4,15000,4.0999999999999996,4,14700,17.2,4,11500,3.5,4,"1-Stage","PSC","2014-04-14"]
["Waterfurnace","US","USV/USH018**2*0","018","Full",17600,14.6,5,21000,4.7,5,20600,23.5,5,17500,4,5,18500,17,5,13700,3.5,5,"1-Stage","PSC","2014-04-14"]
["Waterfurnace","US","USV/USH024**4*0","024","Full",23900,14.6,6,27000,4.7,6,26400,22.8,6,22300,4,6,24400,17,6,17500,3.5,6,"1-Stage","PSC","2014-04-14"]
["Waterfurnace","US","USV/USH030**4*0","030","Full",29500,14.9,8,34600,4.8,8,32900,23,8,28300,4,8,29000,17,8,22800,3.5,8,"1-Stage","PSC","2014-04-14"]
["Waterfurnace","US","USV/USH036**4*0","036","Full",33300,14.4,9,40600,4.5,9,37700,21.2,9,33000,3.9,9,34500,16.600000000000001,9,26000,3.3,9,"1-Stage","PSC","2014-04-14"]
["Waterfurnace","US","USV/USH042**5*0","042","Full",40800,14.5,11,45400,4.5,11,45800,22.8,11,37000,3.8,11,42300,16.8,11,29000,3.3,11,"1-Stage","PSC","2014-04-14"]
["Waterfurnace","US","USV/USH048**5*0","048","Full",47700,14.7,12,56000,4.4000000000000004,12,52000,21,12,45900,3.8,12,49500,16.8,12,36900,3.3,12,"1-Stage","PSC","2014-04-14"]
["Waterfurnace","US","USV/USH060**5*0","060","Full",58400,14.7,15,72500,4.4000000000000004,15,65500,20.8,15,58400,3.8,15,60900,16.600000000000001,15,47100,3.3,15,"1-Stage","PSC","2014-04-14"]
["Waterfurnace","US","USV/USH070**5*0","070","Full",63000,14.2,18,79000,4.4000000000000004,18,70000,20.3,18,64100,3.8,18,68500,15.2,18,51600,3.3,18,"1-Stage","PSC","2014-04-14"]
["Waterfurnace","US","USV041**5*0","041","Full",40000,13.8,11,45000,4.3,11,44500,20.6,11,36000,3.8,11,41000,15.8,11,29000,3.3,11,"1-Stage","PSC","2014-04-14"]
["Whalen","VI","VI-A-1003","030","Full",29200,14.2,7.5,35900,5,7.5,0,0,0,0,0,0,0,0,0,0,0,0,"1-Stage","ECM - CA","2013-04-10"]
["Whalen","VI","VI-A-1203","036","Full",33100,14.2,9,42000,5.2,9,0,0,0,0,0,0,0,0,0,0,0,0,"1-Stage","ECM - CA","2013-04-10"]
["Whalen","VI","VI-A-303","009","Full",9300,14.4,2.5,12000,5.4,2.5,0,0,0,0,0,0,9650,15.4,2.5,7160,3.3,2.5,"1-Stage","ECM - CA","2013-04-10"]
["Whalen","VI","VI-A-403","012","Full",11400,13,3.3,14700,4.7,3.3,0,0,0,0,0,0,11800,14.2,3.3,9260,3.2,3.3,"1-Stage","ECM - CA","2013-04-10"]
["Whalen","VI","VI-A-603","018","Full",18200,15.5,4.5,21800,5.0999999999999996,4.5,0,0,0,0,0,0,19000,16.600000000000001,4.5,13100,3.3,4.5,"1-Stage","ECM - CA","2013-04-10"]
["Whalen","VI","VI-A-803","024","Full",23000,12.5,6,28400,4.3,6,0,0,0,0,0,0,23400,14.2,6,17400,3.2,6,"1-Stage","ECM - CA","2013-04-10"]

{"sheet":"AHRI Part Load Ratings","index":4,"n_rows":249,"n_cols":26,"rows_kept":249,"cut":false,"hidden":true,"merged":[]}
["Manufacturer","Series","Model","Size","Stages","WLHP Cooling Capacity (Btuh)","WLHP Cooling EER (Btuh/Watt)","WLHP Cooling Fluid Flow Rate (Gpm)","WLHP Heating Capacity (Btuh)","WLHP Heating COP","WLHP Heating Fluid Flow Rate (Gpm)","GWHP Cooling Capacity (Btuh)","GWHP Cooling EER (Btuh/Watt)","GWHP Cooling Fluid Flow Rate (Gpm)","GWHP Heating Capacity (Btuh)","GWHP Heating COP","GWHP Heating Fluid Flow Rate (Gpm)","GLHP Cooling Capacity (Btuh)","GLHP Cooling EER (Btuh/Watt)","GLHP Cooling Fluid Flow Rate (Gpm)","GLHP Heating Capacity (Btuh)","GLHP Heating COP","GLHP Heating Fluid Flow Rate (Gpm)","# of Stages","Motor Type","Last Date Modified"]
["ClimateMaster","TE 2-stage","TEV/H/D026","026","Full",25300,17.7,8,30400,5.7,8,28700,27.3,8,24800,5,8,26300,19.899999999999999,8,18900,4,8,"2-Stage","ECM - CA","2013-04-10"]
["ClimateMaster","TE 2-stage","TEV/H/D026","026","Part",19100,19.600000000000001,7,22100,6.5,7,22000,35.299999999999997,7,17700,5.3,7,20900,28,7,15300,4.5999999999999996,7,"2-Stage","ECM - CA","2013-04-10"]
["ClimateMaster","TE 2-stage","TEV/H/D038","038","Full",38000,17.8,9,45100,5.8,9,43300,27.1,9,37200,5.2,9,39900,20.3,9,29200,4.4000000000000004,9,"2-Stage","ECM - CA","2013-04-10"]
["ClimateMaster","TE 2-stage","TEV/H/D038","038","Part",27000,19.5,8,31800,6.4,8,31300,34.4,8,26100,5.4,8,30400,29.6,8,23200,4.8,8,"2-Stage","ECM - CA","2013-04-10"]
["ClimateMaster","TE 2-stage","TEV/H/D049","049","Full",48700,17.3,12,59700,5.5,12,55800,26.1,12,48400,4.8,12,50800,19.3,12,37200,4,12,"2-Stage","ECM - CA","2013-04-10"]
["ClimateMaster","TE 2-stage","TEV/H/D049","049","Part",36500,19.399999999999999,11,43600,6.3,11,42000,34.299999999999997,11,35000,5.0999999999999996,11,40300,27.9,11,30100,4.4000000000000004,11,"2-Stage","ECM - CA","2013-04-10"]
["ClimateMaster","TE 2-stage","TEV/H/D064","064","Full",61500,16.2,15,77400,5.4,15,71500,24.4,15,63200,4.8,15,66200,18.8,15,48700,3.9,15,"2-Stage","ECM - CA","2013-04-10"]
["ClimateMaster","TE 2-stage","TEV/H/D064","064","Part",46300,18.7,14,54700,6,14,53100,32.4,14,44000,5,14,51200,26.7,14,38100,4.4000000000000004,14,"2-Stage","ECM - CA","2013-04-10"]
["ClimateMaster","TE 2-stage","TEV/H/D072","072","Full",68300,15.1,17,85300,4.8,17,77700,22.5,17,71400,4.4000000000000004,17,71700,16.899999999999999,17,55800,3.7,17,"2-Stage","ECM - CA","2013-04-10"]
["ClimateMaster","TE 2-stage","TEV/H/D072","072","Part",53000,16.8,15,64600,5.2,15,60800,28.6,15,53200,4.5,15,58100,23.2,15,46000,3.9,15,"2-Stage","ECM - CA","2013-04-10"]
["ClimateMaster","TT 2-stage","TTV/TTH/TTD026B","026","Full",25300,17.7,8,30400,5.7,8,28700,27.3,8,24800,5,8,26300,19.899999999999999,8,18900,4,8,"2-Stage","ECM - CA","2013-04-10"]
["ClimateMaster","TT 2-stage","TTV/TTH/TTD026B","026","Part",19100,19.600000000000001,7,22100,6.5,7,22000,35.299999999999997,7,17700,5.3,7,20900,28,7,15300,4.5999999999999996,7,"2-Stage","ECM - CA","2013-04-10"]
["ClimateMaster","TT 2-stage","TTV/TTH/TTD038C","038","Full",38000,17.8,9,45100,5.8,9,43300,27.1,9,37200,5.2,9,39900,20.3,9,29200,4.4000000000000004,9,"2-Stage","ECM - CA","2013-04-10"]
["ClimateMaster","TT 2-stage","TTV/TTH/TTD038C","038","Part",27000,19.5,8,31800,6.4,8,31300,34.4,8,26100,5.4,8,30400,29.6,8,23200,4.8,8,"2-Stage","ECM - CA","2013-04-10"]
["ClimateMaster","TT 2-stage","TTV/TTH/TTD049B","049","Full",48700,17.3,12,59700,5.5,12,55800,26.1,12,48400,4.8,12,50800,19.3,12,37200,4,12,"2-Stage","ECM - CA","2013-04-10"]
["ClimateMaster","TT 2-stage","TTV/TTH/TTD049B","049","Part",36500,19.399999999999999,11,43600,6.3,11,42000,34.299999999999997,11,35000,5.0999999999999996,11,40300,27.9,11,30100,4.4000000000000004,11,"2-Stage","ECM - CA","2013-04-10"]
["ClimateMaster","TT 2-stage","TTV/TTH/TTD064B","064","Full",61500,16.2,15,77400,5.4,15,71500,24.4,15,63200,4.8,15,66200,18.8,15,48700,3.9,15,"2-Stage","ECM - CA","2013-04-10"]
["ClimateMaster","TT 2-stage","TTV/TTH/TTD064B","064","Part",46300,18.7,14,54700,6,14,53100,32.4,14,44000,5,14,51200,26.7,14,38100,4.4000000000000004,14,"2-Stage","ECM - CA","2013-04-10"]
["ClimateMaster","TT 2-stage","TTV/TTH/TTD072B","072","Full",68300,15.1,17,85300,4.8,17,77700,22.5,17,71400,4.4000000000000004,17,71700,16.899999999999999,17,55800,3.7,17,"2-Stage","ECM - CA","2013-04-10"]
["ClimateMaster","TT 2-stage","TTV/TTH/TTD072B","072","Part",53000,16.8,15,64600,5.2,15,60800,28.6,15,53200,4.5,15,58100,23.2,15,46000,3.9,15,"2-Stage","ECM - CA","2013-04-10"]
["ClimateMaster","TY 2-stage","TYV/TYH024B","024","Full",24100,14.6,6,28600,4.7,6,27000,22.1,6,23400,4.2,6,25100,16.399999999999999,6,18100,3.6,6,"2-Stage","ECM - CA","2013-04-10"]
["ClimateMaster","TY 2-stage","TYV/TYH024B","024","Part",18400,16.399999999999999,5,21000,5.3,5,20700,27.7,5,17000,4.5,5,20000,22.9,5,15000,4,5,"2-Stage","ECM - CA","2013-04-10"]
["ClimateMaster","TY 2-stage","TYV/TYH030","030","Full",28500,14,8,35800,4.5999999999999996,8,32300,20.7,8,30000,4.2,8,29900,15.7,8,23800,3.6,8,"2-Stage","ECM - CA","2013-04-10"]
["ClimateMaster","TY 2-stage","TYV/TYH030","030","Part",21900,15.2,7,26300,5,7,24900,24.8,7,22000,4.3,7,24200,20.9,7,19400,3.9,7,"2-Stage","ECM - CA","2013-04-10"]
["ClimateMaster","TY 2-stage","TYV/TYH036B","036","Full",35000,15.5,9,43000,4.7,9,39000,23.1,9,35400,4.3,9,35600,17,9,27900,3.7,9,"2-Stage","ECM - CA","2013-04-10"]
["ClimateMaster","TY 2-stage","TYV/TYH036B","036","Part",26200,17.5,8,30500,5.4,8,29500,30,8,25400,4.7,8,27700,23.9,8,22300,4.0999999999999996,8,"2-Stage","ECM - CA","2013-04-10"]
["ClimateMaster","TY 2-stage","TYV/TYH042","042","Full",41100,14.3,10.5,50200,4.5999999999999996,10.5,46300,21.3,10.5,42300,4.0999999999999996,10.5,43100,16.100000000000001,10.5,33300,3.4,10.5,"2-Stage","ECM - CA","2013-04-10"]
["ClimateMaster","TY 2-stage","TYV/TYH042","042","Part",31000,15.8,9,36800,5.0999999999999996,9,35200,26.4,9,30500,4.3,9,34000,22,9,26900,3.8,9,"2-Stage","ECM - CA","2013-04-10"]
["ClimateMaster","TY 2-stage","TYV/TYH048","048","Full",45900,14,12,53800,4.9000000000000004,12,51800,20.9,12,45000,4.4000000000000004,12,48100,15.5,12,35600,3.7,12,"2-Stage","ECM - CA","2013-04-10"]
["ClimateMaster","TY 2-stage","TYV/TYH048","048","Part",34100,15.2,11,39500,5.5,11,39200,26.8,11,32600,4.5999999999999996,11,37600,21.2,11,29200,4.0999999999999996,11,"2-Stage","ECM - CA","2013-04-10"]
["ClimateMaster","TY 2-stage","TYV/TYH060B","060","Full",61700,15.7,14,67500,4.8,14,68000,22.7,14,55400,4.3,14,63200,17.3,14,43700,3.6,14,"2-Stage","ECM - CA","2013-04-10"]
["ClimateMaster","TY 2-stage","TYV/TYH060B","060","Part",45500,17.7,12,49000,5.3,12,50400,28.9,12,39800,4.5,12,48600,23.7,12,34800,4,12,"2-Stage","ECM - CA","2013-04-10"]
["ClimateMaster","TZ 2-stage","TZV/TZH024B","024","Full",24100,14.6,6,28600,4.7,6,27000,22.1,6,23400,4.2,6,25100,16.399999999999999,6,18100,3.6,6,"2-Stage","ECM - CA","2013-04-10"]
["ClimateMaster","TZ 2-stage","TZV/TZH024B","024","Part",18400,16.399999999999999,5,21000,5.3,5,20700,27.7,5,17000,4.5,5,20000,22.9,5,15000,4,5,"2-Stage","ECM - CA","2013-04-10"]
["ClimateMaster","TZ 2-stage","TZV/TZH030","030","Full",28500,14,8,35800,4.5999999999999996,8,32300,20.7,8,30000,4.2,8,29900,15.7,8,23800,3.6,8,"2-Stage","ECM - CA","2013-04-10"]
["ClimateMaster","TZ 2-stage","TZV/TZH030","030","Part",21900,15.2,7,26300,5,7,24900,24.8,7,22000,4.3,7,24200,20.9,7,19400,3.9,7,"2-Stage","ECM - CA","2013-04-10"]
["ClimateMaster","TZ 2-stage","TZV/TZH036B","036","Full",35000,15.5,9,43000,4.7,9,39000,23.1,9,35400,4.3,9,35600,17,9,27900,3.7,9,"2-Stage","ECM - CA","2013-04-10"]
["ClimateMaster","TZ 2-stage","TZV/TZH036B","036","Part",26200,17.5,8,30500,5.4,8,29500,30,8,25400,4.7,8,27700,23.9,8,22300,4.0999999999999996,8,"2-Stage","ECM - CA","2013-04-10"]
["ClimateMaster","TZ 2-stage","TZV/TZH042","042","Full",41100,14.3,10.5,50200,4.5999999999999996,10.5,46300,21.3,10.5,42300,4.0999999999999996,10.5,43100,16.100000000000001,10.5,33300,3.4,10.5,"2-Stage","ECM - CA","2013-04-10"]
["ClimateMaster","TZ 2-stage","TZV/TZH042","042","Part",31000,15.8,9,36800,5.0999999999999996,9,35200,26.4,9,30500,4.3,9,34000,22,9,26900,3.8,9,"2-Stage","ECM - CA","2013-04-10"]
["ClimateMaster","TZ 2-stage","TZV/TZH048","048","Full",45900,14,12,53800,4.9000000000000004,12,51800,20.9,12,45000,4.4000000000000004,12,48100,15.5,12,35600,3.7,12,"2-Stage","ECM - CA","2013-04-10"]
["ClimateMaster","TZ 2-stage","TZV/TZH048","048","Part",34100,15.2,11,39500,5.5,11,39200,26.8,11,32600,4.5999999999999996,11,37600,21.2,11,29200,4.0999999999999996,11,"2-Stage","ECM - CA","2013-04-10"]
["ClimateMaster","TZ 2-stage","TZV/TZH060B","060","Full",61700,15.7,14,67500,4.8,14,68000,22.7,14,55400,4.3,14,63200,17.3,14,43700,3.6,14,"2-Stage","ECM - CA","2013-04-10"]
["ClimateMaster","TZ 2-stage","TZV/TZH060B","060","Part",45500,17.7,12,49000,5.3,12,50400,28.9,12,39800,4.5,12,48600,23.7,12,34800,4,12,"2-Stage","ECM - CA","2013-04-10"]
["Florida Heat Pump","ES 2-stage","ES025-1CF/HZ/VT","025","Full",26000,16,6,30000,5,6,29000,24,6,25000,4.5999999999999996,6,27500,18.7,6,19000,3.8,6,"2-Stage","ECM - CA","2013-04-10"]
["Florida Heat Pump","ES 2-stage","ES025-1CF/HZ/VT","025","Part",18800,17.5,6,20500,5.0999999999999996,6,21000,30,6,18000,4.5999999999999996,6,20000,24.5,6,15500,4,6,"2-Stage","ECM - CA","2013-04-10"]
["Florida Heat Pump","ES 2-stage","ES035-4CF/HZ/VT","035","Full",36000,14.6,9,43000,4.8,9,42000,21.6,9,36000,4.2,9,38000,17.2,9,28000,3.8,9,"2-Stage","ECM - CA","2013-04-10"]
["Florida Heat Pump","ES 2-stage","ES035-4CF/HZ/VT","035","Part",24000,17,9,27000,5.3,9,27000,28,9,22500,4.5,9,27000,24.5,9,20500,4,9,"2-Stage","ECM - CA","2013-04-10"]
["Florida Heat Pump","ES 2-stage","ES049-4CF/HZ/VT","049","Full",48000,12.6,12,58000,4.8,12,54000,19,12,48000,4.2,12,49000,15.5,12,38000,3.6,12,"2-Stage","ECM - CA","2013-04-10"]
["Florida Heat Pump","ES 2-stage","ES049-4CF/HZ/VT","049","Part",34000,16,12,39000,5.4,12,38000,24,12,32000,4.5999999999999996,12,36000,21.8,12,28500,4,12,"2-Stage","ECM - CA","2013-04-10"]
["Florida Heat Pump","ES 2-stage","ES061-4CF/HZ/VT","061","Full",60000,14,14,72000,4.7,14,68000,19.7,14,61000,4.3,14,62000,15.7,14,49000,3.6,14,"2-Stage","ECM - CA","2013-04-10"]
["Florida Heat Pump","ES 2-stage","ES061-4CF/HZ/VT","061","Part",42000,17,14,48000,5.4,14,48000,26,14,40000,4.5999999999999996,14,45000,23.5,14,36500,4,14,"2-Stage","ECM - CA","2013-04-10"]
["Florida Heat Pump","ES 2-stage","ES071-4CF/HZ/VT","071","Full",72000,14.5,18,80000,4.5,18,77000,19.600000000000001,18,68000,4.2,18,74000,16.3,18,53000,3.5,18,"2-Stage","ECM - CA","2013-04-10"]
["Florida Heat Pump","ES 2-stage","ES071-4CF/HZ/VT","071","Part",51000,15.8,18,55000,4.4000000000000004,18,57000,25.2,18,47000,4,18,56000,21.8,18,42000,3.6,18,"2-Stage","ECM - CA","2013-04-10"]
["Florida Heat Pump","LM 2-stage","LM024","024","Full",25500,17.399999999999999,6,29200,5.6,6,29000,26.5,6,23500,4.9000000000000004,6,26600,19.899999999999999,6,18000,4.0999999999999996,6,"2-Stage","ECM - CA","2014-04-15"]
["Florida Heat Pump","LM 2-stage","LM024","024","Part",18500,18.899999999999999,6,21200,6.5,6,21700,33.6,6,16700,5.0999999999999996,6,21000,28.1,6,14400,4.4000000000000004,6,"2-Stage","ECM - CA","2014-04-15"]
["Florida Heat Pump","LM 2-stage","LM036","036","Full",39000,19,9,42800,5.6,9,43300,28,9,35900,5.0999999999999996,9,40800,22,9,28400,4.3,9,"2-Stage","ECM - CA","2014-04-15"]
["Florida Heat Pump","LM 2-stage","LM036","036","Part",29000,22.2,9,31000,6.5,9,32600,37,9,25200,5.2,9,31900,32,9,22400,4.7,9,"2-Stage","ECM - CA","2014-04-15"]
["Florida Heat Pump","LM 2-stage","LM048","048","Full",49200,16.600000000000001,12,56100,5.3,12,55300,25.3,12,46300,4.7,12,51300,19.3,12,36900,4,12,"2-Stage","ECM - CA","2014-04-15"]
["Florida Heat Pump","LM 2-stage","LM048","048","Part",36700,18.899999999999999,12,40900,6.2,12,42000,33.799999999999997,12,33700,5.2,12,39900,27.8,12,29800,4.5,12,"2-Stage","ECM - CA","2014-04-15"]
["Florida Heat Pump","LM 2-stage","LM060","060","Full",63800,17,15,73300,5.2,15,70200,24.4,15,60300,4.5999999999999996,15,65100,18.899999999999999,15,48000,3.9,15,"2-Stage","ECM - CA","2014-04-15"]
["Florida Heat Pump","LM 2-stage","LM060","060","Part",47500,18.7,15,53600,5.8,15,53300,31.2,15,44300,4.8,15,51600,26.5,15,39800,4.4000000000000004,15,"2-Stage","ECM - CA","2014-04-15"]
["Florida Heat Pump","LM 2-stage","LM070","070","Full",71600,16.3,18,84000,5.0999999999999996,18,78700,23.1,18,70000,4.5,18,73700,18.5,18,55300,3.8,18,"2-Stage","ECM - CA","2014-04-15"]
["Florida Heat Pump","LM 2-stage","LM070","070","Part",55200,17.8,18,64900,5.7,18,60800,28.5,18,52900,4.8,18,60300,25.4,18,46900,4.3,18,"2-Stage","ECM - CA","2014-04-15"]
["Johnson Controls","RJT 2-stage","RJTV/RJTH026**4","026","Full",26000,16,8,31000,5.5,8,29000,24,8,25300,5,8,27200,18.600000000000001,8,19500,4.2,8,"2-Stage","ECM - CA","2013-04-10"]
["Johnson Controls","RJT 2-stage","RJTV/RJTH026**4","026","Part",19500,18.600000000000001,7,22600,6.3,7,22000,31.2,7,18100,5.0999999999999996,7,21500,26.8,7,16200,4.7,7,"2-Stage","ECM - CA","2013-04-10"]
["Johnson Controls","RJT 2-stage","RJTV/RJTH038**4","038","Full",39000,17.2,9,42200,5.5,9,39400,24.1,9,34800,5,9,40200,20.100000000000001,9,27000,4.2,9,"2-Stage","ECM - CA","2013-04-10"]
["Johnson Controls","RJT 2-stage","RJTV/RJTH038**4","038","Part",28000,20.100000000000001,8,30300,6.4,8,30500,32.1,8,24800,5.4,8,30100,30,8,22300,5,8,"2-Stage","ECM - CA","2013-04-10"]
["Johnson Controls","RJT 2-stage","RJTV/RJTH049**4","049","Full",48300,15.8,12,57400,5.0999999999999996,12,53200,22.7,12,47200,4.7,12,50000,18,12,37400,4.0999999999999996,12,"2-Stage","ECM - CA","2013-04-10"]
["Johnson Controls","RJT 2-stage","RJTV/RJTH049**4","049","Part",35900,18.100000000000001,11,41900,6.1,11,37800,28.3,11,34000,5.2,11,38700,25.1,11,31000,4.7,11,"2-Stage","ECM - CA","2013-04-10"]
["Johnson Controls","RJT 2-stage","RJTV/RJTH064**4","064","Full",64500,16.2,16,72500,5.0999999999999996,16,70700,22.7,16,56800,4.5999999999999996,16,67600,18,16,45800,3.9,16,"2-Stage","ECM - CA","2013-04-10"]
["Johnson Controls","RJT 2-stage","RJTV/RJTH064**4","064","Part",47000,18.2,14,51500,5.8,14,51500,29.3,14,39600,4.8,14,51100,25.6,14,36000,4.2,14,"2-Stage","ECM - CA","2013-04-10"]
["Johnson Controls","RJT 2-stage","RJTV/RJTH072**4","072","Full",71000,15,18,86700,5,18,79900,20.399999999999999,18,67900,4.4000000000000004,18,73600,16.8,18,54100,3.8,18,"2-Stage","ECM - CA","2013-04-10"]
["Johnson Controls","RJT 2-stage","RJTV/RJTH072**4","072","Part",54000,16.600000000000001,16,63400,5.4,16,62200,26,16,51000,4.5999999999999996,16,58800,23.1,16,45000,4.3,16,"2-Stage","ECM - CA","2013-04-10"]
["Johnson Controls","RKT 2-stage","RKTV/RKTH026**4*1","026","Full",26000,16,8,31000,5.5,8,29000,24,8,25300,5,8,27200,18.600000000000001,8,19500,4.2,8,"2-Stage","ECM - CA","2014-04-11"]
["Johnson Controls","RKT 2-stage","RKTV/RKTH026**4*1","026","Part",19500,18.600000000000001,7,22600,6.3,7,22000,31.2,7,18100,5.0999999999999996,7,21500,26.8,7,16200,4.7,7,"2-Stage","ECM - CA","2014-04-11"]
["Johnson Controls","RKT 2-stage","RKTV/RKTH026G1*4","026","Full",26000,17.3,8,30300,5.5,8,29000,24,8,25100,5,8,27700,20.399999999999999,8,19500,4.3,8,"2-Stage","ECM - CA","2014-04-11"]
["Johnson Controls","RKT 2-stage","RKTV/RKTH026G1*4","026","Part",20000,19.5,7,22300,6.4,7,22600,32.700000000000003,7,18300,5.3,7,22000,27.9,7,16300,4.8,7,"2-Stage","ECM - CA","2014-04-11"]
["Johnson Controls","RKT 2-stage","RKTV/RKTH038**4*1","038","Full",39000,17.2,9,42200,5.5,9,39400,24.1,9,34800,5,9,40200,20.100000000000001,9,27000,4.2,9,"2-Stage","ECM - CA","2014-04-11"]
["Johnson Controls","RKT 2-stage","RKTV/RKTH038**4*1","038","Part",28000,20.100000000000001,8,30300,6.4,8,30500,32.1,8,24800,5.4,8,30100,30,8,22300,5,8,"2-Stage","ECM - CA","2014-04-11"]
["Johnson Controls","RKT 2-stage","RKTV/RKTH038G1*4","038","Full",39000,18,9,40300,5.4,9,39400,24.1,9,33600,4.8,9,40200,21,9,26700,4.0999999999999996,9,"2-Stage","ECM - CA","2014-04-11"]
["Johnson Controls","RKT 2-stage","RKTV/RKTH038G1*4","038","Part",28500,20.3,8,29100,6.3,8,31500,35.4,8,24000,5.0999999999999996,8,30100,30,8,22000,4.8,8,"2-Stage","ECM - CA","2014-04-11"]
["Johnson Controls","RKT 2-stage","RKTV/RKTH049**4*1","049","Full",48300,15.8,12,57400,5.0999999999999996,12,53200,22.7,12,47200,4.7,12,50000,18,12,37400,4.0999999999999996,12,"2-Stage","ECM - CA","2014-04-11"]
["Johnson Controls","RKT 2-stage","RKTV/RKTH049**4*1","049","Part",35900,18.100000000000001,11,41900,6.1,11,37800,28.3,11,34000,5.2,11,38700,25.1,11,31000,4.7,11,"2-Stage","ECM - CA","2014-04-11"]
["Johnson Controls","RKT 2-stage","RKTV/RKTH049F1*4","049","Part",37200,19.2,11,39800,5.8,11,41500,33,11,32300,4.7,11,40600,28.5,11,30000,4.5999999999999996,11,"2-Stage","ECM - CA","2014-04-11"]
["Johnson Controls","RKT 2-stage","RKTV/RKTH049G1*4","049","Full",50300,17.100000000000001,12,56100,5.2,12,56200,24.5,12,46300,4.5999999999999996,12,52000,20,12,37400,4,12,"2-Stage","ECM - CA","2014-04-11"]
["Johnson Controls","RKT 2-stage","RKTV/RKTH049G1*4","049","Part",32700,19.2,11,39800,5.8,11,41500,33,11,32300,4.7,11,40600,28.5,11,30000,4.5999999999999996,11,"2-Stage","ECM - CA","2014-04-11"]
["Johnson Controls","RKT 2-stage","RKTV/RKTH064**4*1","064","Full",64500,16.2,16,72500,5.0999999999999996,16,70700,22.7,16,56800,4.5999999999999996,16,67600,18,16,45800,3.9,16,"2-Stage","ECM - CA","2014-04-11"]
["Johnson Controls","RKT 2-stage","RKTV/RKTH064**4*1","064","Part",47000,18.2,14,51500,5.8,14,51500,29.3,14,39600,4.8,14,51100,25.6,14,36000,4.2,14,"2-Stage","ECM - CA","2014-04-11"]
["Johnson Controls","RKT 2-stage","RKTV/RKTH064G1*4","064","Full",62000,16.3,16,70600,5.2,16,70100,23.9,16,58000,4.7,16,65100,18.7,16,47100,4,16,"2-Stage","ECM - CA","2014-04-11"]
["Johnson Controls","RKT 2-stage","RKTV/RKTH064G1*4","064","Part",45000,18,14,50100,5.8,14,51500,29.9,14,41300,5,14,50000,25.9,14,37000,4.4000000000000004,14,"2-Stage","ECM - CA","2014-04-11"]
["Johnson Controls","RKT 2-stage","RKTV/RKTH072**4*1","072","Full",71000,15,18,86700,5,18,79900,20.399999999999999,18,67900,4.4000000000000004,18,73600,16.8,18,54100,3.8,18,"2-Stage","ECM - CA","2014-04-11"]
["Johnson Controls","RKT 2-stage","RKTV/RKTH072**4*1","072","Part",54000,16.600000000000001,16,63400,5.4,16,62200,26,16,51000,4.5999999999999996,16,58800,23.1,16,45000,4.3,16,"2-Stage","ECM - CA","2014-04-11"]
["Johnson Controls","RKT 2-stage","RKTV/RKTH072G1*4","072","Full",69000,15,18,81900,4.8,18,78500,22,18,67500,4.3,18,71600,17,18,54200,3.7,18,"2-Stage","ECM - CA","2014-04-11"]
["Johnson Controls","RKT 2-stage","RKTV/RKTH072G1*4","072","Part",52800,16,16,61400,5.2,16,61000,27,16,49400,4.4000000000000004,16,59000,23.4,16,45000,4.0999999999999996,16,"2-Stage","ECM - CA","2014-04-11"]
["Mammoth","HHA / HLA 2-stage","D024HHA","024","Full",27800,17.2,6.5,28700,4.9000000000000004,6.5,0,0,0,0,0,0,28600,18.8,6.5,16400,3.1,6.5,"2-Stage","ECM - CA","2013-04-10"]
["Mammoth","HHA / HLA 2-stage","D024HHA","024","Part",19500,18.3,6.5,20200,5.0999999999999996,6.5,0,0,0,0,0,0,0,0,0,0,0,0,"2-Stage","ECM - CA","2013-04-10"]
["Mammoth","HHA / HLA 2-stage","D030HHA","030","Full",33200,17.100000000000001,9,37600,4.9000000000000004,9,0,0,0,0,0,0,34100,18.600000000000001,9,21500,3.1,9,"2-Stage","ECM - CA","2013-04-10"]
["Mammoth","HHA / HLA 2-stage","D030HHA","030","Part",22800,17.8,9,26200,5.3,9,0,0,0,0,0,0,0,0,0,0,0,0,"2-Stage","ECM - CA","2013-04-10"]
["Mammoth","HHA / HLA 2-stage","D036HHA","036","Full",38500,16,10.5,40100,4.7,10.5,0,0,0,0,0,0,40400,17.899999999999999,10.5,23500,3,10.5,"2-Stage","ECM - CA","2013-04-10"]
["Mammoth","HHA / HLA 2-stage","D036HHA","036","Part",28000,18.100000000000001,10.5,27400,5.0999999999999996,10.5,0,0,0,0,0,0,0,0,0,0,0,0,"2-Stage","ECM - CA","2013-04-10"]
["Mammoth","HHA / HLA 2-stage","D042HHA","042","Full",47100,15.55,12,47100,4.5,12,0,0,0,0,0,0,48300,18.100000000000001,12,27000,2.9,12,"2-Stage","ECM - CA","2013-04-10"]
["Mammoth","HHA / HLA 2-stage","D042HHA","042","Part",32200,17.55,12,32700,4.9000000000000004,12,0,0,0,0,0,0,0,0,0,0,0,0,"2-Stage","ECM - CA","2013-04-10"]
["Mammoth","HHA / HLA 2-stage","D048HHA","048","Full",45500,15.5,14,58900,5,14,0,0,0,0,0,0,52200,18.899999999999999,14,33800,3.2,14,"2-Stage","ECM - CA","2013-04-10"]
["Mammoth","HHA / HLA 2-stage","D048HHA","048","Part",33600,16.25,14,40600,5.5,14,0,0,0,0,0,0,0,0,0,0,0,0,"2-Stage","ECM - CA","2013-04-10"]
["Mammoth","HHA / HLA 2-stage","D060HHA","060","Full",63000,15.8,17,70000,4.8,17,0,0,0,0,0,0,66300,17.7,17,41000,3.1,17,"2-Stage","ECM - CA","2013-04-10"]
["Mammoth","HHA / HLA 2-stage","D060HHA","060","Part",44800,16.899999999999999,17,49500,4.5999999999999996,17,0,0,0,0,0,0,0,0,0,0,0,0,"2-Stage","ECM - CA","2013-04-10"]
["Mammoth","HHA / HLA 2-stage","D072HHA","072","Full",75800,16,20,81800,4.3,20,0,0,0,0,0,0,75700,17.399999999999999,20,47900,2.8,20,"2-Stage","ECM - CA","2013-04-10"]
["Mammoth","HHA / HLA 2-stage","D072HHA","072","Part",55100,16.3,20,60900,4.5,20,0,0,0,0,0,0,0,0,0,0,0,0,"2-Stage","ECM - CA","2013-04-10"]
["Mammoth","VHA / VLA 2-stage","D024VHA","024","Full",28000,17.5,7,28000,5.0999999999999996,7,0,0,0,0,0,0,28500,19.5,6.5,16400,3.2,6.5,"2-Stage","ECM - CA","2014-04-11"]
["Mammoth","VHA / VLA 2-stage","D024VHA","024","Part",19200,18.8,7,19900,5.5,7,0,0,0,0,0,0,0,0,0,0,0,0,"2-Stage","ECM - CA","2014-04-11"]
["Mammoth","VHA / VLA 2-stage","D030VHA","030","Full",34700,16.399999999999999,9,35700,5.0999999999999996,9,0,0,0,0,0,0,35200,18.5,9,22100,3.3,9,"2-Stage","ECM - CA","2014-04-11"]
["Mammoth","VHA / VLA 2-stage","D030VHA","030","Part",22400,17.600000000000001,9,25400,5.4,9,0,0,0,0,0,0,0,0,0,0,0,0,"2-Stage","ECM - CA","2014-04-11"]
["Mammoth","VHA / VLA 2-stage","D036VHA","036","Full",38500,15.5,10.5,40000,4.8,10.5,0,0,0,0,0,0,39400,17.399999999999999,10.5,21500,3.1,10.5,"2-Stage","ECM - CA","2014-04-11"]
["Mammoth","VHA / VLA 2-stage","D036VHA","036","Part",27500,18.8,10.5,28500,5.5,10.5,0,0,0,0,0,0,0,0,0,0,0,0,"2-Stage","ECM - CA","2014-04-11"]
["Mammoth","VHA / VLA 2-stage","D042VHA","042","Full",44600,14.05,12,49000,4.5999999999999996,12,0,0,0,0,0,0,45500,16.600000000000001,12,28500,2.9,12,"2-Stage","ECM - CA","2014-04-11"]
["Mammoth","VHA / VLA 2-stage","D042VHA","042","Part",30500,16.149999999999999,12,35100,5.0999999999999996,12,0,0,0,0,0,0,0,0,0,0,0,0,"2-Stage","ECM - CA","2014-04-11"]
["Mammoth","VHA / VLA 2-stage","D048VHA","048","Full",49700,15.1,14,54200,4.9000000000000004,14,0,0,0,0,0,0,57000,20.5,14,33500,3.2,14,"2-Stage","ECM - CA","2014-04-11"]
["Mammoth","VHA / VLA 2-stage","D048VHA","048","Part",37300,18,14,37600,5.4,14,0,0,0,0,0,0,0,0,0,0,0,0,"2-Stage","ECM - CA","2014-04-11"]
["Mammoth","VHA / VLA 2-stage","D060VHA","060","Full",63000,15.8,17,68800,4.5,17,0,0,0,0,0,0,66200,17.7,17,40100,2.9,17,"2-Stage","ECM - CA","2014-04-11"]
["Mammoth","VHA / VLA 2-stage","D060VHA","060","Part",46000,17,17,48800,4.5999999999999996,17,0,0,0,0,0,0,0,0,0,0,0,0,"2-Stage","ECM - CA","2014-04-11"]
["Mammoth","VHA / VLA 2-stage","D072VHA","072","Full",76700,16,20,80500,4.5,20,0,0,0,0,0,0,73800,15.9,20,47000,2.9,20,"2-Stage","ECM - CA","2014-04-11"]
["Mammoth","VHA / VLA 2-stage","D072VHA","072","Part",53500,14.6,20,58800,4.7,20,0,0,0,0,0,0,0,0,0,0,0,0,"2-Stage","ECM - CA","2014-04-11"]
["McQuay","WGT 2-stage","WGTV/WGTH026B*K","026","Full",26400,18,6.5,29300,5.7,6.5,29700,26.9,6.5,23400,5,6.5,27600,20.7,6.5,18100,4.0999999999999996,6.5,"2-Stage","ECM - CA","2013-04-10"]
["McQuay","WGT 2-stage","WGTV/WGTH026B*K","026","Part",19800,20.3,6.5,21800,6.4,6.5,22800,35.299999999999997,6.5,17200,5.0999999999999996,6.5,22000,29.8,6.5,15100,4.5999999999999996,6.5,"2-Stage","ECM - CA","2013-04-10"]
["McQuay","WGT 2-stage","WGTV/WGTH032B*K","032","Full",32500,16.5,7.5,36400,5.3,7.5,35800,24,7.5,30100,4.8,7.5,33800,18.899999999999999,7.5,23700,4.0999999999999996,7.5,"2-Stage","ECM - CA","2013-04-10"]
["McQuay","WGT 2-stage","WGTV/WGTH032B*K","032","Part",24700,18.5,7.5,27800,6,7.5,27600,30.1,7.5,22500,5,7.5,26800,25.9,7.5,19800,4.5,7.5,"2-Stage","ECM - CA","2013-04-10"]
["McQuay","WGT 2-stage","WGTV/WGTH038B*K","038","Full",39000,17.600000000000001,9,44400,5.6,9,42000,25.4,9,36200,5,9,40200,20.100000000000001,9,28100,4.2,9,"2-Stage","ECM - CA","2013-04-10"]
["McQuay","WGT 2-stage","WGTV/WGTH038B*K","038","Part",28300,20.2,9,32600,6.4,9,31400,34.200000000000003,9,26000,5.3,9,30500,28.9,9,22500,4.7,9,"2-Stage","ECM - CA","2013-04-10"]
["McQuay","WGT 2-stage","WGTV/WGTH044B*K","044","Full",44400,17.3,10.5,50100,5.4,10.5,48300,25.4,10.5,40600,4.7,10.5,45900,19.8,10.5,31700,4,10.5,"2-Stage","ECM - CA","2013-04-10"]
["McQuay","WGT 2-stage","WGTV/WGTH044B*K","044","Part",32900,19.7,10.5,36600,6,10.5,36400,33.6,10.5,29000,4.9000000000000004,10.5,35500,28.3,10.5,25600,4.4000000000000004,10.5,"2-Stage","ECM - CA","2013-04-10"]
["McQuay","WGT 2-stage","WGTV/WGTH049B*K","049","Full",48900,16.7,12.2,55300,5.3,12.2,53800,24.8,12.2,45900,4.7,12.2,50600,19.2,12.2,35900,4,12.2,"2-Stage","ECM - CA","2013-04-10"]
["McQuay","WGT 2-stage","WGTV/WGTH049B*K","049","Part",36900,19.600000000000001,12.2,40800,6,12.2,40700,33.5,12.2,32900,4.9000000000000004,12.2,39600,28.2,12.2,29200,4.4000000000000004,12.2,"2-Stage","ECM - CA","2013-04-10"]
["McQuay","WGT 2-stage","WGTV/WGTH064B*K","064","Full",64800,17.399999999999999,16,76100,5.2,16,71000,24.7,16,60600,4.5999999999999996,16,67100,19.7,16,47000,3.9,16,"2-Stage","ECM - CA","2013-04-10"]
["McQuay","WGT 2-stage","WGTV/WGTH064B*K","064","Part",48200,19.7,16,53800,5.8,16,53500,32.799999999999997,16,43200,4.8,16,52200,28,16,38300,4.3,16,"2-Stage","ECM - CA","2013-04-10"]
["McQuay","WGT 2-stage","WGTV/WGTH072B*K","072","Full",72700,15.9,17.5,88400,5,17.5,78900,22.6,17.5,70900,4.4000000000000004,17.5,75300,18.100000000000001,17.5,55200,3.7,17.5,"2-Stage","ECM - CA","2013-04-10"]
["McQuay","WGT 2-stage","WGTV/WGTH072B*K","072","Part",56400,18.5,17.5,64600,5.5,17.5,62400,30.8,17.5,52300,4.5999999999999996,17.5,60700,26.1,17.5,46200,4.2,17.5,"2-Stage","ECM - CA","2013-04-10"]
["Trane","DXH 2-stage","DXHF024","024","Full",26200,17.7,5.6,31700,5.4,5.6,29100,26,5.6,25600,4.7,5.6,27400,20.399999999999999,5.6,18700,3.8,5.6,"2-Stage","ECM - CA","2014-05-08"]
["Trane","DXH 2-stage","DXHF024","024","Part",19600,19.399999999999999,5.6,23800,5.9,5.6,22200,32.200000000000003,5.6,18900,4.9000000000000004,5.6,21500,27.7,5.6,16000,4.2,5.6,"2-Stage","ECM - CA","2014-05-08"]
["Trane","DXH 2-stage","DXHF036","036","Full",37400,16.3,8.4,47500,5.0999999999999996,8.4,41800,24.1,8.4,39500,4.7,8.4,39100,18.7,8.4,29200,3.8,8.4,"2-Stage","ECM - CA","2014-05-08"]
["Trane","DXH 2-stage","DXHF036","036","Part",27700,18.8,8.4,34400,5.7,8.4,31200,31.5,8.4,28200,5.0999999999999996,8.4,30200,27.2,8.4,24000,4.3,8.4,"2-Stage","ECM - CA","2014-05-08"]
["Trane","DXH 2-stage","DXHF048","048","Full",51200,17.2,11.2,62400,5.4,11.2,56600,24.7,11.2,50800,4.8,11.2,53000,19.5,11.2,38800,3.9,11.2,"2-Stage","ECM - CA","2014-05-08"]
["Trane","DXH 2-stage","DXHF048","048","Part",38200,19.2,11.2,46400,5.9,11.2,42800,31.6,11.2,37500,4.9000000000000004,11.2,41100,26.7,11.2,32700,4.4000000000000004,11.2,"2-Stage","ECM - CA","2014-05-08"]
["Trane","DXH 2-stage","DXHF060","060","Full",59300,15.1,14,82000,5.0999999999999996,14,66800,20.9,14,67400,4.5999999999999996,14,62100,17.2,14,50800,3.8,14,"2-Stage","ECM - CA","2014-05-08"]
["Trane","DXH 2-stage","DXHF060","060","Part",44100,17,14,59700,5.6,14,50400,27.2,14,48100,4.8,14,48800,23.8,14,41100,4.2,14,"2-Stage","ECM - CA","2014-05-08"]
["Trane","DXH 2-stage","DXHF070","070","Full",67800,15.5,15.4,88300,4.9000000000000004,15.4,74100,22.1,15.4,72700,4.5,15.4,70400,17.600000000000001,15.4,56800,3.8,15.4,"2-Stage","ECM - CA","2014-05-08"]
["Trane","DXH 2-stage","DXHF070","070","Part",52500,17,15.4,67100,5.2,15.4,58300,27.6,15.4,54600,4.5,15.4,56600,23.7,15.4,47900,4.0999999999999996,15.4,"2-Stage","ECM - CA","2014-05-08"]
["Trane","DXV 2-stage","DXVF024","024","Full",25700,17.7,5.6,31300,5.3,5.6,28000,25.8,5.6,25400,4.9000000000000004,5.6,26400,20.2,5.6,19300,4,5.6,"2-Stage","ECM - CA","2014-05-08"]
["Trane","DXV 2-stage","DXVF024","024","Part",19400,19.600000000000001,5.6,23600,6,5.6,21400,32.5,5.6,19000,5.0999999999999996,5.6,21000,28,5.6,16300,4.4000000000000004,5.6,"2-Stage","ECM - CA","2014-05-08"]
["Trane","DXV 2-stage","DXVF036","036","Full",37200,16.600000000000001,8.4,47100,5.0999999999999996,8.4,40700,24.1,8.4,38800,4.7,8.4,38400,19.100000000000001,8.4,30200,4,8.4,"2-Stage","ECM - CA","2014-05-08"]
["Trane","DXV 2-stage","DXVF036","036","Part",27100,18.899999999999999,8.4,34100,5.8,8.4,30100,30.8,8.4,27700,5,8.4,29300,26.3,8.4,24200,4.4000000000000004,8.4,"2-Stage","ECM - CA","2014-05-08"]
["Trane","DXV 2-stage","DXVF048","048","Full",49500,17.100000000000001,11.2,61100,5.5,11.2,54200,24.8,11.2,50400,4.9000000000000004,11.2,51100,19.399999999999999,11.2,39300,4.0999999999999996,11.2,"2-Stage","ECM - CA","2014-05-08"]
["Trane","DXV 2-stage","DXVF048","048","Part",36500,18.600000000000001,11.2,45500,6.1,11.2,41000,31,11.2,37000,5.0999999999999996,11.2,39800,26.5,11.2,32200,4.5,11.2,"2-Stage","ECM - CA","2014-05-08"]
["Trane","DXV 2-stage","DXVF060","060","Full",59800,16.100000000000001,14,79000,5.3,14,65700,22.7,14,65400,4.8,14,62100,18.2,14,51100,4,14,"2-Stage","ECM - CA","2014-05-08"]
["Trane","DXV 2-stage","DXVF060","060","Part",43000,17.2,14,56100,5.7,14,48700,28.4,14,45500,4.8,14,47200,24.3,14,39100,4.3,14,"2-Stage","ECM - CA","2014-05-08"]
["Trane","DXV 2-stage","DXVF070","070","Full",68300,15.6,15.4,90300,4.9000000000000004,15.4,74600,22.5,15.4,75000,4.5,15.4,70700,17.8,15.4,58500,3.9,15.4,"2-Stage","ECM - CA","2014-05-08"]
["Trane","DXV 2-stage","DXVF070","070","Part",52100,16.899999999999999,15.4,69600,5.3,15.4,58400,27.8,15.4,56700,4.5999999999999996,15.4,56800,23.9,15.4,49700,4.2,15.4,"2-Stage","ECM - CA","2014-05-08"]
["Trane","TCT 2-stage","TCT026**4","026","Full",25600,15.7,9,30400,5.4,9,29000,24,8,25300,5,8,27000,18.399999999999999,8,18900,4.0999999999999996,8,"2-Stage","ECM - CA","2013-04-10"]
["Trane","TCT 2-stage","TCT026**4","026","Part",19400,18.5,7,22600,6.2,7,21700,30.8,7,18100,5.2,7,21300,26.4,7,16000,4.5999999999999996,7,"2-Stage","ECM - CA","2013-04-10"]
["Trane","TCT 2-stage","TCT038**4","038","Full",38600,17.100000000000001,9,41800,5.5,9,39400,24,9,34700,4.9000000000000004,9,40000,19.8,9,26600,4.0999999999999996,9,"2-Stage","ECM - CA","2013-04-10"]
["Trane","TCT 2-stage","TCT038**4","038","Part",27500,19.399999999999999,8,29600,6.4,8,30200,31.7,8,24800,5.3,8,30000,28,8,22200,4.8,8,"2-Stage","ECM - CA","2013-04-10"]
["Trane","TCT 2-stage","TCT049**4","049","Full",47900,15.8,12,57000,5.0999999999999996,12,53000,22.6,12,47000,4.7,12,49600,18,12,37300,4,12,"2-Stage","ECM - CA","2013-04-10"]
["Trane","TCT 2-stage","TCT049**4","049","Part",35800,18,11,41800,6,11,37600,28.3,11,34000,5.2,11,38700,25,11,31000,4.5,11,"2-Stage","ECM - CA","2013-04-10"]
["Trane","TCT 2-stage","TCT064**4","064","Full",64100,16,16,72100,5,16,70700,22.2,16,56200,4.5,16,67600,17.8,16,45400,3.8,16,"2-Stage","ECM - CA","2013-04-10"]
["Trane","TCT 2-stage","TCT064**4","064","Part",47000,18.100000000000001,14,50500,5.7,14,51500,29,14,39400,4.7,14,51100,25.6,14,34000,4.0999999999999996,14,"2-Stage","ECM - CA","2013-04-10"]
["Trane","TCT 2-stage","TCT072**4","072","Full",71000,14.9,18,86400,5,18,79200,20.100000000000001,18,67500,4.3,18,73000,16.8,18,54000,3.7,18,"2-Stage","ECM - CA","2013-04-10"]
["Trane","TCT 2-stage","TCT072**4","072","Part",54000,16.600000000000001,16,62900,5.2,16,62000,25,16,50500,4.4000000000000004,16,58400,22.7,16,44200,4,16,"2-Stage","ECM - CA","2013-04-10"]
["Waterfurnace","NB 2-stage","NBV/NBH026**4*4","026","Full",26000,17.3,8,30300,5.5,8,29000,24,8,25100,5,8,27700,20.399999999999999,8,19500,4.3,8,"2-Stage","ECM - CA","2013-04-10"]
["Waterfurnace","NB 2-stage","NBV/NBH026**4*4","026","Part",20000,19.5,7,22300,6.4,7,22600,32.700000000000003,7,18300,5.3,7,22000,27.9,7,16300,4.8,7,"2-Stage","ECM - CA","2013-04-10"]
["Waterfurnace","NB 2-stage","NBV/NBH038**4*4","038","Full",39000,18,9,40300,5.4,9,39400,24.1,9,33600,4.8,9,40200,21,9,26700,4.0999999999999996,9,"2-Stage","ECM - CA","2013-04-10"]
["Waterfurnace","NB 2-stage","NBV/NBH038**4*4","038","Part",28500,20.3,8,29100,6.3,8,31500,35.4,8,24000,5.0999999999999996,8,30100,30,8,22000,4.8,7,"2-Stage","ECM - CA","2013-04-10"]
["Waterfurnace","NB 2-stage","NBV/NBH049**4*4","049","Full",50300,17.100000000000001,12,56100,5.2,12,56200,24.5,12,46300,4.5999999999999996,12,52000,20,12,37400,4,12,"2-Stage","ECM - CA","2013-04-10"]
["Waterfurnace","NB 2-stage","NBV/NBH049**4*4","049","Part",37200,19.2,11,39800,5.8,11,41500,33,11,32300,4.7,11,40600,28.5,11,30000,4.5999999999999996,11,"2-Stage","ECM - CA","2013-04-10"]
["Waterfurnace","NB 2-stage","NBV/NBH064**4*4","064","Full",62000,16.3,16,70600,5.2,16,70100,23.9,16,58000,4.7,16,65100,18.7,16,47100,4,16,"2-Stage","ECM - CA","2013-04-10"]
["Waterfurnace","NB 2-stage","NBV/NBH064**4*4","064","Part",45000,18,14,50100,5.8,14,51500,29.9,14,41300,5,14,50000,25.9,14,37000,4.4000000000000004,14,"2-Stage","ECM - CA","2013-04-10"]
["Waterfurnace","NB 2-stage","NBV/NBH072**4*4","072","Full",69000,15,18,81900,4.8,18,78500,22,18,67500,4.3,18,71600,17,18,54200,3.7,18,"2-Stage","ECM - CA","2013-04-10"]
["Waterfurnace","NB 2-stage","NBV/NBH072**4*4","072","Part",52800,16,16,61400,4.4000000000000004,16,61000,27,16,49400,4.4000000000000004,16,59000,23.4,16,45000,4.0999999999999996,16,"2-Stage","ECM - CA","2013-04-10"]
["Waterfurnace","ND 2-stage","NDV/NDH026**4*1","026","Full",26000,16,8,31000,5.5,8,29000,24,8,25300,5,8,27200,18.600000000000001,8,19500,4.2,8,"2-Stage","ECM - CA","2014-04-11"]
["Waterfurnace","ND 2-stage","NDV/NDH026**4*1","026","Part",19500,18.600000000000001,7,22600,6.3,7,22000,31.2,7,18100,5.0999999999999996,7,21500,26.8,7,16200,4.7,7,"2-Stage","ECM - CA","2014-04-11"]
["Waterfurnace","ND 2-stage","NDV/NDH026G1*4","026","Full",26000,17.3,8,30300,5.5,8,29000,24,8,25100,5,8,27700,20.399999999999999,8,19500,4.3,8,"2-Stage","ECM - CA","2014-04-11"]
["Waterfurnace","ND 2-stage","NDV/NDH026G1*4","026","Part",20000,19.5,7,22300,6.4,7,22600,32.700000000000003,7,18300,5.3,7,22000,27.9,7,16300,4.8,7,"2-Stage","ECM - CA","2014-04-11"]
["Waterfurnace","ND 2-stage","NDV/NDH038**4*1","038","Full",39000,17.2,9,42200,5.5,9,39400,24.1,9,34800,5,9,40200,20.100000000000001,9,27000,4.2,9,"2-Stage","ECM - CA","2014-04-11"]
["Waterfurnace","ND 2-stage","NDV/NDH038**4*1","038","Part",28000,20.100000000000001,8,30300,6.4,8,30500,32.1,8,24800,5.4,8,30100,30,8,22300,5,8,"2-Stage","ECM - CA","2014-04-11"]
["Waterfurnace","ND 2-stage","NDV/NDH038G1*4","038","Full",39000,18,9,40300,5.4,9,39400,24.1,9,33600,4.8,9,40200,21,9,26700,4.0999999999999996,9,"2-Stage","ECM - CA","2014-04-11"]
["Waterfurnace","ND 2-stage","NDV/NDH038G1*4","038","Part",28500,20.3,8,29100,6.3,8,31500,35.4,8,24000,5.0999999999999996,8,30100,30,8,22000,4.8,8,"2-Stage","ECM - CA","2014-04-11"]
["Waterfurnace","ND 2-stage","NDV/NDH049**4*1","049","Full",48300,15.8,12,57400,5.0999999999999996,12,53200,22.7,12,47200,4.7,12,50000,18,12,37400,4.0999999999999996,12,"2-Stage","ECM - CA","2014-04-11"]
["Waterfurnace","ND 2-stage","NDV/NDH049**4*1","049","Part",35900,18.100000000000001,11,41900,6.1,11,37800,28.3,11,34000,5.2,11,38700,25.1,11,31000,4.7,11,"2-Stage","ECM - CA","2014-04-11"]
["Waterfurnace","ND 2-stage","NDV/NDH049F1*4","049","Part",37200,19.2,11,39800,5.8,11,41500,33,11,32300,4.7,11,40600,28.5,11,30000,4.5999999999999996,11,"2-Stage","ECM - CA","2014-04-11"]
["Waterfurnace","ND 2-stage","NDV/NDH049G1*4","049","Full",50300,17.100000000000001,12,56100,5.2,12,56200,24.5,12,46300,4.5999999999999996,12,52000,20,12,37400,4,12,"2-Stage","ECM - CA","2014-04-11"]
["Waterfurnace","ND 2-stage","NDV/NDH049G1*4","049","Part",32700,19.2,11,39800,5.8,11,41500,33,11,32300,4.7,11,40600,28.5,11,30000,4.5999999999999996,11,"2-Stage","ECM - CA","2014-04-11"]
["Waterfurnace","ND 2-stage","NDV/NDH064**4*1","064","Full",64500,16.2,16,72500,5.0999999999999996,16,70700,22.7,16,56800,4.5999999999999996,16,67600,18,16,45800,3.9,16,"2-Stage","ECM - CA","2014-04-11"]
["Waterfurnace","ND 2-stage","NDV/NDH064**4*1","064","Part",47000,18.2,14,51500,5.8,14,51500,29.3,14,39600,4.8,14,51100,25.6,14,36000,4.2,14,"2-Stage","ECM - CA","2014-04-11"]
["Waterfurnace","ND 2-stage","NDV/NDH064G1*4","064","Full",62000,16.3,16,70600,5.2,16,70100,23.9,16,58000,4.7,16,65100,18.7,16,47100,4,16,"2-Stage","ECM - CA","2014-04-11"]
["Waterfurnace","ND 2-stage","NDV/NDH064G1*4","064","Part",45000,18,14,50100,5.8,14,51500,29.9,14,41300,5,14,50000,25.9,14,37000,4.4000000000000004,14,"2-Stage","ECM - CA","2014-04-11"]
["Waterfurnace","ND 2-stage","NDV/NDH072**4*1","072","Full",71000,15,18,86700,5,18,79900,20.399999999999999,18,67900,4.4000000000000004,18,73600,16.8,18,54100,3.8,18,"2-Stage","ECM - CA","2014-04-11"]
["Waterfurnace","ND 2-stage","NDV/NDH072**4*1","072","Part",54000,16.600000000000001,16,63400,5.4,16,62200,26,16,51000,4.5999999999999996,16,58800,23.1,16,45000,4.3,16,"2-Stage","ECM - CA","2014-04-11"]
["Waterfurnace","ND 2-stage","NDV/NDH072G1*4","072","Full",69000,15,18,81900,4.8,18,78500,22,18,67500,4.3,18,71600,17,18,54200,3.7,18,"2-Stage","ECM - CA","2014-04-11"]
["Waterfurnace","ND 2-stage","NDV/NDH072G1*4","072","Part",52800,16,16,61400,5.2,16,61000,27,16,49400,4.4000000000000004,16,59000,23.4,16,45000,4.0999999999999996,16,"2-Stage","ECM - CA","2014-04-11"]
["Waterfurnace","NDW 2-stage","NDW100*5","100","Full",93000,14.6,23,125000,4,23,105000,22,23,103000,3.3,23,100000,16.8,23,82000,3,23,"2-Stage","NA","2013-04-10"]
["Waterfurnace","NDW 2-stage","NDW100*5","100","Part",50000,15.8,23,65000,4.5999999999999996,23,56000,24.5,23,53000,3.7,23,54000,22,23,47000,3.4,23,"2-Stage","NA","2013-04-10"]
["Waterfurnace","NDW 2-stage","NDW120*5","120","Full",103000,14,28,142000,4,28,123000,21.6,28,118000,3.3,28,114000,16.2,28,93000,3,28,"2-Stage","NA","2013-04-10"]
["Waterfurnace","NDW 2-stage","NDW120*5","120","Part",58000,15.5,28,76000,4,28,65000,22.4,28,62500,3.7,28,63000,21.1,28,55000,3.4,28,"2-Stage","NA","2013-04-10"]
["Waterfurnace","NDW 2-stage","NDW150*5","150","Full",129000,13.5,32,199000,4,32,153000,21.1,32,148000,3.2,32,147000,16,32,123000,2.8,32,"2-Stage","NA","2013-04-10"]
["Waterfurnace","NDW 2-stage","NDW150*5","150","Part",72000,15.3,32,101000,4.3,32,75000,22,32,73000,3.7,32,78000,20.7,32,70000,3.3,32,"2-Stage","NA","2013-04-10"]
["Waterfurnace","NDW 2-stage","NDW180*5","180","Full",150000,13.3,36,221000,3.9,36,175000,19.8,36,173000,3.1,36,165000,15.8,36,139000,2.7,36,"2-Stage","NA","2013-04-10"]
["Waterfurnace","NDW 2-stage","NDW180*5","180","Part",78000,15,36,113000,4.2,36,89000,20.9,36,87000,3.7,36,86000,18.399999999999999,36,82000,3.5,36,"2-Stage","NA","2013-04-10"]
["Waterfurnace","NXW 2-stage","NXW096*5","096","Full",93000,14.6,23,125000,4,23,105000,22,23,103000,3.3,23,100000,16.8,23,82000,2.8,23,"2-Stage","NA","2013-04-10"]
["Waterfurnace","NXW 2-stage","NXW096*5","096","Part",50000,15.8,23,65000,4.5999999999999996,23,56000,24.5,23,53000,3.7,23,54000,22,23,47000,3.4,23,"2-Stage","NA","2013-04-10"]
["Waterfurnace","NXW 2-stage","NXW108*5","108","Full",103000,14,28,142000,4,28,123000,21.6,28,118000,3.3,28,114000,16.2,28,93000,3,28,"2-Stage","NA","2013-04-10"]
["Waterfurnace","NXW 2-stage","NXW108*5","108","Part",58000,15.5,28,76000,4,28,65000,22.4,28,62500,3.7,28,63000,21.1,28,55000,3.4,28,"2-Stage","NA","2013-04-10"]
["Waterfurnace","NXW 2-stage","NXW120*5","120","Full",128000,13.8,32,175000,3.8,32,151000,21,32,145000,3.2,32,139000,16,32,115000,2.8,32,"2-Stage","NA","2013-04-10"]
["Waterfurnace","NXW 2-stage","NXW120*5","120","Part",72000,15.4,32,94000,4.3,32,79000,22.5,32,78000,3.7,32,78000,20.5,32,68000,3.1,32,"2-Stage","NA","2013-04-10"]
["Waterfurnace","NXW 2-stage","NXW140*5","140","Full",143000,14.5,36,193000,4.2,36,166000,22.5,36,160000,3.8,36,155000,17,36,127000,3.1,36,"2-Stage","NA","2013-04-10"]
["Waterfurnace","NXW 2-stage","NXW140*5","140","Part",79000,15.5,36,103000,4.7,36,89000,23.4,36,83000,4.2,36,87000,21,36,75000,3.5,36,"2-Stage","NA","2013-04-10"]
["Waterfurnace","NXW 2-stage","NXW180*5","180","Full",170000,14,45,209000,3.9,45,183000,20,45,189000,3.5,45,177000,15.8,45,153000,2.8,45,"2-Stage","NA","2013-04-10"]
["Waterfurnace","NXW 2-stage","NXW180*5","180","Part",89000,15,45,110000,4.2,45,100000,19.8,45,98000,3.8,45,98000,18.8,45,89000,3.1,45,"2-Stage","NA","2013-04-10"]
["Waterfurnace","NXW 2-stage","NXW210*5","210","Full",202000,14.8,52,257000,4.2,52,227000,21.8,52,219000,3.8,52,212000,17,52,173000,3.1,52,"2-Stage","NA","2013-04-10"]
["Waterfurnace","NXW 2-stage","NXW210*5","210","Part",107000,15.5,52,136000,4.7,52,122000,23.8,52,116000,4.2,52,120000,20.8,52,91000,3.4,52,"2-Stage","NA","2013-04-10"]
["Waterfurnace","NXW 2-stage","NXW240*5","240","Full",222000,13.3,60,286000,3.9,60,257000,20,60,244000,3.5,60,242000,15.5,60,193000,2.8,60,"2-Stage","NA","2013-04-10"]
["Waterfurnace","NXW 2-stage","NXW240*5","240","Part",117000,13.9,60,150000,4.3,60,137000,21,60,123000,3.8,60,132000,18.7,60,102000,3,60,"2-Stage","NA","2013-04-10"]
["Waterfurnace","NXW 2-stage","NXW360*5","360","Full",335000,14.3,86,452600,4.3,86,"NA","NA","NA","NA","NA","NA",351000,16.2,86,296500,3.2,86,"2-Stage","NA","2013-04-10"]
["Waterfurnace","NXW 2-stage","NXW360*5","360","Part",175000,15.1,86,237600,4.5999999999999996,86,"NA","NA","NA","NA","NA","NA",191500,19.600000000000001,86,170000,3.5,86,"2-Stage","NA","2013-04-10"]
["Waterfurnace","NXW 2-stage","NXW540*5","540","Full",533400,14.5,135,691200,4.3,135,"NA","NA","NA","NA","NA","NA",558500,16.399999999999999,135,485800,3.3,135,"2-Stage","NA","2013-04-10"]
["Waterfurnace","NXW 2-stage","NXW540*5","540","Part",277300,15.2,135,359400,4.5,135,"NA","NA","NA","NA","NA","NA",302800,19.5,135,282600,3.7,135,"2-Stage","NA","2013-04-10"]
["McQuay","WDFW Variable Speed","WDFW036","036","Full",31900,16.2,9,32100,4.5999999999999996,9,38900,29.4,9,30100,4.7,9,35600,20.399999999999999,9,23400,3.9,9,"Variable","ECM - CA","2014-04-15"]
["McQuay","WDFW Variable Speed","WDFW036","036","Part",14400,23.8,9,10900,6.8,9,15900,62.5,9,9900,5.2,9,15600,47.3,9,8700,4.3,9,"Variable","ECM - CA","2014-04-15"]
["McQuay","WDFW Variable Speed","WDFW048","048","Full",42300,15.9,12,47900,5.3,12,50900,30.5,12,40700,4.7,12,46600,20.2,12,32000,3.9,12,"Variable","ECM - CA","2014-04-15"]
["McQuay","WDFW Variable Speed","WDFW048","048","Part",21600,20.100000000000001,12,21200,7.1,12,17200,39.200000000000003,12,18800,5.0999999999999996,12,21700,33.4,12,17100,4.5,12,"Variable","ECM - CA","2014-04-15"]
["Trane","VSH 2-stage","VSH024","024","Full",25100,18.3,6.2,30300,6.44,6.2,28400,31.76,6.2,24300,5.33,6.2,26200,21.82,6.2,18500,4.3499999999999996,6.2,"Variable","ECM - CA","2014-04-11"]
["Trane","VSH 2-stage","VSH024","024","Part",13800,23.67,6.2,15900,8.64,6.2,15500,48.23,6.2,12400,6.37,6.2,15000,36.43,6.2,10300,4.99,6.2,"Variable","ECM - CA","2014-04-11"]
["Trane","VSH 2-stage","VSH033","033","Full",33800,15.79,8.6,40200,5.85,8.6,37900,25.01,8.6,32300,4.9800000000000004,8.6,35300,18.510000000000002,8.6,24700,4.0999999999999996,8.6,"Variable","ECM - CA","2014-04-11"]
["Trane","VSH 2-stage","VSH033","033","Part",17600,21.96,8.6,21000,7.71,8.6,19700,41.82,8.6,16600,5.94,8.6,18900,32.229999999999997,8.6,14300,4.96,8.6,"Variable","ECM - CA","2014-04-11"]
["Trane","VSH 2-stage","VSH042","042","Full",42600,18.600000000000001,10.5,51800,6.7,10.5,47300,30.9,10.5,42000,5.6,10.5,44600,22,10.5,31500,4.5,10.5,"Variable","ECM - CA","2014-04-11"]
["Trane","VSH 2-stage","VSH042","042","Part",24100,23.26,10.5,29800,8.2100000000000009,10.5,27200,48.49,10.5,23500,6.45,10.5,26100,35.380000000000003,10.5,18800,5.39,10.5,"Variable","ECM - CA","2014-04-11"]
["Trane","VSH 2-stage","VSH050","050","Full",50200,16.5,12.7,64400,5.8,12.7,56200,26,12.7,52500,5.0999999999999996,12.7,52400,19.3,12.7,40100,4.2,12.7,"Variable","ECM - CA","2014-04-11"]
["Trane","VSH 2-stage","VSH050","050","Part",28400,22.29,12.7,36100,7.52,12.7,32400,42.02,12.7,29100,6.16,12.7,31000,33.67,12.7,24000,5.28,12.7,"Variable","ECM - CA","2014-04-11"]
["Trane","VSH 2-stage","VSH060","060","Full",60700,14.8,15.6,81600,5.3,15.6,67300,22.8,15.6,66800,4.7,15.6,63200,17,15.6,50400,3.8,15.6,"Variable","ECM - CA","2014-04-11"]
["Trane","VSH 2-stage","VSH060","060","Part",36400,20.56,15.6,46500,6.77,15.6,40900,37.58,15.6,37400,5.72,15.6,39100,31.43,15.6,31300,5.0599999999999996,15.6,"Variable","ECM - CA","2014-04-11"]
["Trane","VSV 2-stage","VSV024","024","Full",24600,18.440000000000001,6.2,30300,6.1,6.2,27800,33.24,6.2,24400,5.2,6.2,25900,22.32,6.2,18400,4.17,6.2,"Variable","ECM - CA","2014-04-11"]
["Trane","VSV 2-stage","VSV024","024","Part",13100,22.58,6.2,15900,7.62,6.2,15000,48.48,6.2,12100,6.13,6.2,14300,35.31,6.2,9900,4.8099999999999996,6.2,"Variable","ECM - CA","2014-04-11"]
["Trane","VSV 2-stage","VSV033","033","Full",32900,15.47,8.3000000000000007,40400,5.46,8.3000000000000007,36600,24.67,8.3000000000000007,32400,4.7699999999999996,8.3000000000000007,34300,18.079999999999998,8.3000000000000007,24500,3.86,8.3000000000000007,"Variable","ECM - CA","2014-04-11"]
["Trane","VSV 2-stage","VSV033","033","Part",17100,20.81,8.3000000000000007,21500,6.96,8.3000000000000007,19400,40.79,8.3000000000000007,16800,5.59,8.3000000000000007,18500,31.59,8.3000000000000007,14100,4.5999999999999996,8.3000000000000007,"Variable","ECM - CA","2014-04-11"]
["Trane","VSV 2-stage","VSV042","042","Full",44100,18.25,10.9,54700,5.95,10.9,50100,32.46,10.9,43600,5.08,10.9,46200,22.03,10.9,31900,3.98,10.9,"Variable","ECM - CA","2014-04-11"]
["Trane","VSV 2-stage","VSV042","042","Part",25500,24.17,10.9,29400,7.5,10.9,28700,51.26,10.9,22700,5.85,10.9,26900,40.5,10.9,17800,4.59,10.9,"Variable","ECM - CA","2014-04-11"]
["Trane","VSV 2-stage","VSV050","050","Full",51200,15.72,13,68800,5.32,13,57800,26.19,13,54600,4.58,13,54100,18.760000000000002,13,41400,3.75,13,"Variable","ECM - CA","2014-04-11"]
["Trane","VSV 2-stage","VSV050","050","Part",29900,22.08,13,36800,6.88,13,33500,42.46,13,28500,5.5,13,32800,34,13,23400,4.62,13,"Variable","ECM - CA","2014-04-11"]
["Trane","VSV 2-stage","VSV060","060","Full",61800,15.6,15.6,81200,5.5,15.6,70400,25.4,15.6,65400,4.8,15.6,64600,18.3,15.6,50000,4,15.6,"Variable","ECM - CA","2014-04-11"]
["Trane","VSV 2-stage","VSV060","060","Part",35900,21.28,15.6,46300,7.3,15.6,41300,41.38,15.6,36200,5.91,15.6,39600,32.880000000000003,15.6,30400,5.29,15.6,"Variable","ECM - CA","2014-04-11"]