{"text_format":"1","workbook":"xlsx","n_sheets":5,"sheets":["Comparison","data","Lists","AHRI Ratings","AHRI Part Load Ratings"],"not_rendered":{"charts":8,"images":1,"macros":1,"external_links":1,"defined_names":26,"comments":0,"pivot_tables":0},"unopened":[],"bounds":{"document_bytes":16777216,"sheet_cells":100000,"rows_first":2000,"rows_last":500,"rows_between":2000,"halvings":0,"cell_chars":16384,"cell_head_chars":4096},"cells_cut":0,"cells_raw":0,"read":"whole","date_system":"1900"}

{"sheet":"Comparison","index":0,"n_rows":88,"n_cols":12,"rows_kept":88,"cut":false,"hidden":false,"merged":[[74,5,74,7],[76,5,76,7],[78,5,78,7],[74,9,74,11],[76,9,76,11],[78,9,78,11],[72,5,72,7],[12,4,12,5],[26,1,26,3],[26,4,26,6],[72,9,72,11],[52,4,52,6],[60,4,60,6],[34,4,34,6],[74,0,74,3],[76,0,76,3],[78,0,78,3],[8,0,8,1],[10,0,10,1],[70,1,70,3],[10,2,10,3],[72,0,72,3],[52,1,52,3],[60,1,60,3],[34,1,34,3]]}
[]
[]
[]
[]
[]
[]
["Building Location",null,null,null,null,null,null,"Loop Information",null,null,"Unit Cost"]
[]
["Select State",null,"Maryland",null,"Select Country","USA",null,"25% Methanol"," Fluid",null,null,{"$f":"IF(C21=\"\",\"\",C21&\" Price\")","v":"Whalen Price"}]
[]
["Select Location",null,"Baltimore - Washngtn Int'l Airport",null,null,null,null,70," Loop Temp (F)",null,null,1979]
[]
[null,null,null,{"$f":"IF(C11=\"\",\"Enter location\",\"Your selected location reports a commercial electric cost of $\")","v":"Your selected location reports a commercial electric cost of $"},{"$f":"IF(C11=\"\",\"\",ROUND(VLOOKUP(C11&\", \"&C9,data!$D$2:$Q$993,9,FALSE),3))","v":0.104},null,null,75," System Head (Ft)",null,null,{"$f":"IF(C47=\"\",\"\",C47&\" Price\")","v":"Whalen Price"}]
[]
[null,null,null,{"$f":"IF(C11=\"\",\"\",\"Your selected location reports Cooling Load Hours of\")","v":"Your selected location reports Cooling Load Hours of"},{"$f":"IF(C11=\"\",\"\",ROUND(VLOOKUP(C11&\", \"&C9,data!$D$2:$Q$993,2,FALSE),\"0\"))","v":1254},null,null,80," Pump Efficiency (%)",null,null,1652]
[null,null,null,{"$f":"IF(C11=\"\",\"\",\"Your selected location reports Heating Load Hours of\")","v":"Your selected location reports Heating Load Hours of"},{"$f":"IF(C11=\"\",\"\",ROUND(VLOOKUP(C11&\", \"&C9,data!$D$2:$Q$993,3,FALSE),\"0\"))","v":2298}]
[]
[]
[{"$f":"IF(C25=\"\",\"Unit 1 Information\",\"Unit 1 Information: \"&VLOOKUP(C25,'AHRI Ratings'!$C$2:$X$909,22,FALSE)&\" Operation\")","v":"Unit 1 Information: 1-Stage Operation"}]
[]
{"$rows_left_out":69}
{"sheet":"data","index":1,"n_rows":1030,"n_cols":29,"rows_kept":1030,"cut":false,"hidden":true,"merged":[[0,20,0,28],[11,20,11,28],[10,19,10,28]]}
["Country","State","City","City & State","CLH","HLH","State annual CO2 non-baseload  output emission rate (lb/MWh) ","State annual NOx non-baseload output emission rate (lb/MWh)","State annual SO2 non-baseload output emission rate (lb/MWh) ","State annual CH4 non-baseload output emission rate (lb/GWh)","Residential electric cost ($/kWh)","Commercial electric cost ($/kWh)","Industrial electric cost ($/kWh)","Heating 99% DB","Cooling 2% DB","HDD65","CDD65","Commercial Natural Gas Price\n($/thousand ft3)",null,null,"Density"]
["USA","Alabama","Anniston",{"$f":"C2&\", \"&B2","v":"Anniston, Alabama"},1763,1596,1568.9645,1.3754999999999999,7.0098000000000003,28.080100000000002,0.11398,0.10634,6.225E-2,24.5,90.3,2694,1859,12.55,null,"deg C",4.4444444444444446,10,15.555555555555557,21.111111111111111,26.666666666666668,32.222222222222221,37.777777777777779,43.333333333333336,48.888888888888893]
["USA","Alabama","Auburn-Opelika","Auburn-Opelika, Alabama",1821,1533,1568.9645,1.3754999999999999,7.0098000000000003,28.080100000000002,0.11398,0.10634,6.225E-2,27.7,89.5,2383,1859,12.55,null,"deg F",40,50,60,70,80,90,100,110,120]
["USA","Alabama","Birmingham","Birmingham, Alabama",1826,1576,1568.9645,1.3754999999999999,7.0098000000000003,28.080100000000002,0.11398,0.10634,6.225E-2,24,90.6,2693,1948,12.55,null,"Water",1,1,1,1,1,1,1,1,1]
["USA","Alabama","Cairns AAF/Ozark","Cairns AAF/Ozark, Alabama",2204,1222,1568.9645,1.3754999999999999,7.0098000000000003,28.080100000000002,0.11398,0.10634,6.225E-2,30.3,91.3,1767,2415,12.55,null,"Ethanol",0.77352706179903696,0.77724424544371895,0.78100634822486337,0.78474578622906599,0.78859936560283928,0.79243028515381486,0.7963787185694603,0.80030451821026993,0.80435135145431758]
["USA","Alabama","Centreville","Centreville, Alabama",1837,1509,1568.9645,1.3754999999999999,7.0098000000000003,28.080100000000002,0.11398,0.10634,6.225E-2,25.8,89.8,2465,1898,12.55,null,"Methanol",0.77350384225764879,0.77759736792740386,0.78174440013786106,0.78587048168614781,0.79012671952670943,0.79436217498468598,0.79873198960142733,0.80308122624878064,0.80756922522338581]
["USA","Alabama","Dauphin Island","Dauphin Island, Alabama",3010,1141,1568.9645,1.3754999999999999,7.0098000000000003,28.080100000000002,0.11398,0.10634,6.225E-2,37.6,86,1303,2634,12.55,null,"Ethylene glycol",1.0922729072381578,1.0944225258649753,1.0965857945202544,1.0987238461515758,1.100914558214654,1.1030798196418312,1.1052985006690756,1.1074914946430929,1.1097386836966434]
["USA","Alabama","Dothan","Dothan, Alabama",2273,1223,1568.9645,1.3754999999999999,7.0098000000000003,28.080100000000002,0.11398,0.10634,6.225E-2,31.1,91.2,1727,2481,12.55,null,"Propylene glycol",0.95801943148094759,0.96074572137601921,0.96349414950471379,0.96621530928992494,0.96900842306202206,0.97177400569981875,0.97461290383280264,0.97742400607338153,0.98030982360216279]
["USA","Alabama","Gadsen","Gadsen, Alabama",1501,1799,1568.9645,1.3754999999999999,7.0098000000000003,28.080100000000002,0.11398,0.10634,6.225E-2,22.1,89.9,3215,1557,12.55]
["USA","Alabama","Huntsville Int'l / Jones Field","Huntsville Int'l / Jones Field, Alabama",1666,1736,1568.9645,1.3754999999999999,7.0098000000000003,28.080100000000002,0.11398,0.10634,6.225E-2,21.6,90.1,3140,1742,12.55]
["USA","Alabama","Maxwell AFB / Montgomery","Maxwell AFB / Montgomery, Alabama",2203,1299,1568.9645,1.3754999999999999,7.0098000000000003,28.080100000000002,0.11398,0.10634,6.225E-2,31.5,93.3,1813,2598,12.55,null,"Specific Gravity of Anti-Freeze Mixture at various Temperatures"]
["USA","Alabama","Mobile","Mobile, Alabama",2336,1163,1568.9645,1.3754999999999999,7.0098000000000003,28.080100000000002,0.11398,0.10634,6.225E-2,30.7,90.3,1662,2463,12.55,null,null,"Degree F"]
["USA","Alabama","Montgomery","Montgomery, Alabama",2021,1364,1568.9645,1.3754999999999999,7.0098000000000003,28.080100000000002,0.11398,0.10634,6.225E-2,27.3,92.1,2143,2282,12.55,null,"Mixture",40,50,60,70,80,90,100,110,120]
["USA","Alabama","Muscle Shoals","Muscle Shoals, Alabama",1688,1725,1568.9645,1.3754999999999999,7.0098000000000003,28.080100000000002,0.11398,0.10634,6.225E-2,22.1,90.9,3084,1822,12.55,null,"Water",1,1,1,1,1,1,1,1,1]
["USA","Alabama","Tuscaloosa","Tuscaloosa, Alabama",1910,1505,1568.9645,1.3754999999999999,7.0098000000000003,28.080100000000002,0.11398,0.10634,6.225E-2,25,91.4,2509,2101,12.55,null,"5% Ethanol",{"$f":"((95*U$4)+(5*U$5))/100","v":0.98867635308995194},{"$f":"((95*V$4)+(5*V$5))/100","v":0.98886221227218596},0.98905031741124316,0.98923728931145338,0.98942996828014207,0.98962151425769074,0.98981893592847303,0.9900152259105135,0.99021756757271584]
["USA","Alaska","Fairbanks","Fairbanks, Alaska",178,3149,1348.2862,5.7268999999999997,1.8946000000000001,38.4131,0.17882999999999999,0.14927000000000001,0.16821,-38.1,74.599999999999994,13528,71,8.09,null,"10% Ethanol",{"$f":"((90*U$4)+(10*U$5))/100","v":0.97735270617990366},{"$f":"((90*V$4)+(10*V$5))/100","v":0.97772442454437192},0.97810063482248633,0.97847457862290654,0.97885993656028392,0.97924302851538148,0.97963787185694595,0.98003045182102699,0.98043513514543179]
["USA","Alaska","Ft. Richardson","Ft. Richardson, Alaska",26,3322,1348.2862,5.7268999999999997,1.8946000000000001,38.4131,0.17882999999999999,0.14927000000000001,0.16821,-12.5,67.8,10726,3,8.09,null,"15% Ethanol",{"$f":"((85*U$4)+(15*U$5))/100","v":0.96602905926985561},{"$f":"((85*V$4)+(15*V$5))/100","v":0.96658663681655776},0.9671509522337296,0.96771186793435993,0.96828990484042587,0.96886454277307221,0.96945680778541898,0.97004567773154049,0.97065270271814763]
["USA","Alaska","Anchorage / Elmendorf AFB","Anchorage / Elmendorf AFB, Alaska",88,2825,1348.2862,5.7268999999999997,1.8946000000000001,38.4131,0.17882999999999999,0.14927000000000001,0.16821,-23,68,10360,11,8.09,null,"20% Ethanol",{"$f":"((80*U$4)+(20*U$5))/100","v":0.95470541235980733},{"$f":"((80*V$4)+(20*V$5))/100","v":0.95544884908874383},0.95620126964497276,0.9569491572458132,0.95771987312056783,0.95848605703076306,0.95927574371389202,0.96006090364205388,0.96087027029086358]
["USA","Alaska","Lake Hood Seaplane","Lake Hood Seaplane, Alaska",120,2771,1348.2862,5.7268999999999997,1.8946000000000001,38.4131,0.17882999999999999,0.14927000000000001,0.16821,-20.100000000000001,68.2,9824,16,8.09,null,"25% Ethanol",{"$f":"((75*U$4)+(25*U$5))/100","v":0.94338176544975927},{"$f":"((75*V$4)+(25*V$5))/100","v":0.94431106136092979},0.94525158705621581,0.94618644655726658,0.94714984140070979,0.94810757128845369,0.94909467964236516,0.95007612955256748,0.95108783786357942]
["USA","Alaska","Anchorage Int'l Airport","Anchorage Int'l Airport, Alaska",133,2851,1348.2862,5.7268999999999997,1.8946000000000001,38.4131,0.17882999999999999,0.14927000000000001,0.16821,-20.2,65.900000000000006,10121,5,8.09,null,"5% Methanol",{"$f":"((95*U$4)+(5*U$6))/100","v":0.98867519211288235},{"$f":"((95*V$4)+(5*V$6))/100","v":0.98887986839637021},0.98908722000689309,0.98929352408430749,0.98950633597633542,0.98971810874923438,0.9899365994800714,0.9901540613124391,0.99037846126116935]
{"$rows_left_out":1011}
{"sheet":"Lists","index":2,"n_rows":103,"n_cols":7,"rows_kept":103,"cut":false,"hidden":true,"merged":[]}
["Country","USA State","Canada State",null,"Manufacturer",null,"Loop Type"]
["USA","Alabama","Alberta",null,"ClimateMaster",null,"Water Loop"]
["Canada","Alaska","British Columbia",null,"Florida Heat Pump",null,"Ground Water"]
[null,"Arizona","Manitoba",null,"Johnson Controls",null,"Geothermal"]
[null,"Arkansas","New Brunswick",null,"Mammoth",null,"Air Source"]
[null,"California","Newfoundland",null,"McQuay"]
[null,"Colorado","Northwest Territories",null,"Rittling"]
[null,"Connecticut","Nova Scotia",null,"Trane"]
[null,"Delaware","Nunavut",null,"Waterfurnace"]
[null,"Florida","Ontario",null,"Whalen"]
[null,"Georgia","Prince Edward Island",null,"Generic Air Source"]
[null,"Hawaii","Québec",null,"Generic WSHP"]
[null,"Idaho","Saskatchewan"]
[null,"Illinois","Yukon Territory"]
[null,"Indiana",null,null,"Manufacturer","Model"]
[null,"Iowa",null,null,"ClimateMaster","TC"]
[null,"Kansas",null,null,"ClimateMaster","TE 2-stage"]
[null,"Kentucky",null,null,"ClimateMaster","THW"]
[null,"Louisiana",null,null,"ClimateMaster","TL"]
[null,"Maine",null,null,"ClimateMaster","TMW"]
{"$rows_left_out":84}
{"sheet":"AHRI Ratings","index":3,"n_rows":909,"n_cols":26,"rows_kept":909,"cut":false,"hidden":true,"merged":[]}
["Manufacturer","Series","Model","Size","Stages","WLHP Cooling Capacity (Btuh)","WLHP Cooling EER (Btuh/Watt)","WLHP Cooling Fluid Flow Rate (Gpm)","WLHP Heating Capacity (Btuh)","WLHP Heating COP","WLHP Heating Fluid Flow Rate (Gpm)","GWHP Cooling Capacity (Btuh)","GWHP Cooling EER (Btuh/Watt)","GWHP Cooling Fluid Flow Rate (Gpm)","GWHP Heating Capacity (Btuh)","GWHP Heating COP","GWHP Heating Fluid Flow Rate (Gpm)","GLHP Cooling Capacity (Btuh)","GLHP Cooling EER (Btuh/Watt)","GLHP Cooling Fluid Flow Rate (Gpm)","GLHP Heating Capacity (Btuh)","GLHP Heating COP","GLHP Heating Fluid Flow Rate (Gpm)","# of Stages","Motor Type","Last Date Modified"]
["ClimateMaster","TC","TCH072AF","072","Full",69000,13.3,20,92500,5,20,78500,19.7,20,75500,4.4000000000000004,20,71000,14.6,20,58000,3.5,20,"1-Stage","Belt Drive","2013-04-10"]
["ClimateMaster","TC","TCH096AF","096","Full",95000,13.7,24,123000,5,24,104500,20,24,101000,4.4000000000000004,24,98000,15.2,24,77000,3.6,24,"1-Stage","Belt Drive","2013-04-10"]
["ClimateMaster","TC","TCH120AF","120","Full",119000,13.3,30,160000,4.5999999999999996,30,134000,19.3,30,132500,4,30,122500,14.5,30,103000,3.3,30,"1-Stage","Belt Drive","2013-04-10"]
["ClimateMaster","TC","TCV072AF","072","Full",69000,13.3,20,92500,5,20,78500,19.7,20,75500,4.4000000000000004,20,71000,14.6,20,58000,3.5,20,"1-Stage","Belt Drive","2013-04-10"]
["ClimateMaster","TC","TCV096AF","096","Full",95000,13.7,24,123000,5,24,104500,20,24,101000,4.4000000000000004,24,98000,15.2,24,77000,3.6,24,"1-Stage","Belt Drive","2013-04-10"]
["ClimateMaster","TC","TCV120AF","120","Full",119000,13.3,30,160000,4.5999999999999996,30,134000,19.3,30,132500,4,30,122500,14.5,30,103000,3.3,30,"1-Stage","Belt Drive","2013-04-10"]
["ClimateMaster","TC","TCV168AF","168","Full",157000,14.2,42,207000,4.9000000000000004,42,172000,19.600000000000001,42,168000,4.4000000000000004,42,162000,15.2,42,125000,3.5,42,"1-Stage","Belt Drive","2013-04-10"]
["ClimateMaster","TC","TCV192AF","192","Full",191500,14.3,48,243000,5.0999999999999996,48,211000,19.5,48,196500,4.5,48,199000,15.8,48,149000,3.7,48,"1-Stage","Belt Drive","2013-04-10"]
["ClimateMaster","TC","TCV240AF","240","Full",233000,13.9,60,318000,5,60,263500,19.2,60,260500,4.4000000000000004,60,240000,14.8,60,198500,3.5,60,"1-Stage","Belt Drive","2013-04-10"]
["ClimateMaster","TC","TCV300AF","300","Full",300000,13.5,75,395000,4.8,75,341500,18.7,75,321500,4.3,75,310000,14.5,75,240000,3.4,75,"1-Stage","Belt Drive","2013-04-10"]
["ClimateMaster","TC","TCH/V006AE","006","Full",5800,13.2,2,7500,4.7,2,6900,21.1,2,6200,4,2,6200,15.4,2,4900,3.4,2,"1-Stage","PSC","2013-04-10"]
["ClimateMaster","TC","TCH/V009AE","009","Full",8800,13.4,2.6,11600,4.2,2.6,10100,21,2.6,9800,3.9,2.6,9300,15.7,2.6,7900,3.4,2.6,"1-Stage","PSC","2013-04-10"]
["ClimateMaster","TC","TCH/V012AE","012","Full",11700,13.5,3.5,15200,4.3,3.5,13700,20.8,3.5,12500,3.8,3.5,12000,14.9,3.5,9900,3.2,3.5,"1-Stage","PSC","2013-04-10"]
["ClimateMaster","TC","TCH/V015AE","015","Full",14500,15.4,4,17300,5,4,16800,24.5,4,14400,4.4000000000000004,4,15000,17.2,4,11100,3.6,4,"1-Stage","PSC","2013-04-10"]
["ClimateMaster","TC","TCH/V018AE","018","Full",17300,14.3,4.5,21500,5,4.5,20600,24.2,4.5,17200,4.4000000000000004,4.5,18400,16.3,4.5,13900,3.4,4.5,"1-Stage","PSC","2013-04-10"]
["ClimateMaster","TC","TCH/V024AF","024","Full",23700,13.4,6.5,28500,4.7,6.5,26700,20.9,6.5,24000,4.0999999999999996,6.5,24900,15.4,6.5,18500,3.3,6.5,"1-Stage","PSC","2013-04-10"]
["ClimateMaster","TC","TCH/V030AF","030","Full",28100,13.4,8,35100,4.5999999999999996,8,31700,20.100000000000001,8,29600,4.0999999999999996,8,28900,15.1,8,23400,3.4,8,"1-Stage","PSC","2013-04-10"]
["ClimateMaster","TC","TCH/V036AF","036","Full",34500,13.5,9.5,45200,4.4000000000000004,9.5,38700,20.7,9.5,37500,4,9.5,35300,14.9,9.5,29600,3.3,9.5,"1-Stage","PSC","2013-04-10"]
["ClimateMaster","TC","TCH/V042AF","042","Full",40100,13.1,11.25,52700,4.3,11.25,45900,19.600000000000001,11.25,44000,3.8,11.25,40500,14.4,11.25,34300,3.3,11.25,"1-Stage","PSC","2013-04-10"]
{"$rows_left_out":890}
{"sheet":"AHRI Part Load Ratings","index":4,"n_rows":249,"n_cols":26,"rows_kept":249,"cut":false,"hidden":true,"merged":[]}
["Manufacturer","Series","Model","Size","Stages","WLHP Cooling Capacity (Btuh)","WLHP Cooling EER (Btuh/Watt)","WLHP Cooling Fluid Flow Rate (Gpm)","WLHP Heating Capacity (Btuh)","WLHP Heating COP","WLHP Heating Fluid Flow Rate (Gpm)","GWHP Cooling Capacity (Btuh)","GWHP Cooling EER (Btuh/Watt)","GWHP Cooling Fluid Flow Rate (Gpm)","GWHP Heating Capacity (Btuh)","GWHP Heating COP","GWHP Heating Fluid Flow Rate (Gpm)","GLHP Cooling Capacity (Btuh)","GLHP Cooling EER (Btuh/Watt)","GLHP Cooling Fluid Flow Rate (Gpm)","GLHP Heating Capacity (Btuh)","GLHP Heating COP","GLHP Heating Fluid Flow Rate (Gpm)","# of Stages","Motor Type","Last Date Modified"]
["ClimateMaster","TE 2-stage","TEV/H/D026","026","Full",25300,17.7,8,30400,5.7,8,28700,27.3,8,24800,5,8,26300,19.899999999999999,8,18900,4,8,"2-Stage","ECM - CA","2013-04-10"]
["ClimateMaster","TE 2-stage","TEV/H/D026","026","Part",19100,19.600000000000001,7,22100,6.5,7,22000,35.299999999999997,7,17700,5.3,7,20900,28,7,15300,4.5999999999999996,7,"2-Stage","ECM - CA","2013-04-10"]
["ClimateMaster","TE 2-stage","TEV/H/D038","038","Full",38000,17.8,9,45100,5.8,9,43300,27.1,9,37200,5.2,9,39900,20.3,9,29200,4.4000000000000004,9,"2-Stage","ECM - CA","2013-04-10"]
["ClimateMaster","TE 2-stage","TEV/H/D038","038","Part",27000,19.5,8,31800,6.4,8,31300,34.4,8,26100,5.4,8,30400,29.6,8,23200,4.8,8,"2-Stage","ECM - CA","2013-04-10"]
["ClimateMaster","TE 2-stage","TEV/H/D049","049","Full",48700,17.3,12,59700,5.5,12,55800,26.1,12,48400,4.8,12,50800,19.3,12,37200,4,12,"2-Stage","ECM - CA","2013-04-10"]
["ClimateMaster","TE 2-stage","TEV/H/D049","049","Part",36500,19.399999999999999,11,43600,6.3,11,42000,34.299999999999997,11,35000,5.0999999999999996,11,40300,27.9,11,30100,4.4000000000000004,11,"2-Stage","ECM - CA","2013-04-10"]
["ClimateMaster","TE 2-stage","TEV/H/D064","064","Full",61500,16.2,15,77400,5.4,15,71500,24.4,15,63200,4.8,15,66200,18.8,15,48700,3.9,15,"2-Stage","ECM - CA","2013-04-10"]
["ClimateMaster","TE 2-stage","TEV/H/D064","064","Part",46300,18.7,14,54700,6,14,53100,32.4,14,44000,5,14,51200,26.7,14,38100,4.4000000000000004,14,"2-Stage","ECM - CA","2013-04-10"]
["ClimateMaster","TE 2-stage","TEV/H/D072","072","Full",68300,15.1,17,85300,4.8,17,77700,22.5,17,71400,4.4000000000000004,17,71700,16.899999999999999,17,55800,3.7,17,"2-Stage","ECM - CA","2013-04-10"]
["ClimateMaster","TE 2-stage","TEV/H/D072","072","Part",53000,16.8,15,64600,5.2,15,60800,28.6,15,53200,4.5,15,58100,23.2,15,46000,3.9,15,"2-Stage","ECM - CA","2013-04-10"]
["ClimateMaster","TT 2-stage","TTV/TTH/TTD026B","026","Full",25300,17.7,8,30400,5.7,8,28700,27.3,8,24800,5,8,26300,19.899999999999999,8,18900,4,8,"2-Stage","ECM - CA","2013-04-10"]
["ClimateMaster","TT 2-stage","TTV/TTH/TTD026B","026","Part",19100,19.600000000000001,7,22100,6.5,7,22000,35.299999999999997,7,17700,5.3,7,20900,28,7,15300,4.5999999999999996,7,"2-Stage","ECM - CA","2013-04-10"]
["ClimateMaster","TT 2-stage","TTV/TTH/TTD038C","038","Full",38000,17.8,9,45100,5.8,9,43300,27.1,9,37200,5.2,9,39900,20.3,9,29200,4.4000000000000004,9,"2-Stage","ECM - CA","2013-04-10"]
["ClimateMaster","TT 2-stage","TTV/TTH/TTD038C","038","Part",27000,19.5,8,31800,6.4,8,31300,34.4,8,26100,5.4,8,30400,29.6,8,23200,4.8,8,"2-Stage","ECM - CA","2013-04-10"]
["ClimateMaster","TT 2-stage","TTV/TTH/TTD049B","049","Full",48700,17.3,12,59700,5.5,12,55800,26.1,12,48400,4.8,12,50800,19.3,12,37200,4,12,"2-Stage","ECM - CA","2013-04-10"]
["ClimateMaster","TT 2-stage","TTV/TTH/TTD049B","049","Part",36500,19.399999999999999,11,43600,6.3,11,42000,34.299999999999997,11,35000,5.0999999999999996,11,40300,27.9,11,30100,4.4000000000000004,11,"2-Stage","ECM - CA","2013-04-10"]
["ClimateMaster","TT 2-stage","TTV/TTH/TTD064B","064","Full",61500,16.2,15,77400,5.4,15,71500,24.4,15,63200,4.8,15,66200,18.8,15,48700,3.9,15,"2-Stage","ECM - CA","2013-04-10"]
["ClimateMaster","TT 2-stage","TTV/TTH/TTD064B","064","Part",46300,18.7,14,54700,6,14,53100,32.4,14,44000,5,14,51200,26.7,14,38100,4.4000000000000004,14,"2-Stage","ECM - CA","2013-04-10"]
["ClimateMaster","TT 2-stage","TTV/TTH/TTD072B","072","Full",68300,15.1,17,85300,4.8,17,77700,22.5,17,71400,4.4000000000000004,17,71700,16.899999999999999,17,55800,3.7,17,"2-Stage","ECM - CA","2013-04-10"]
{"$rows_left_out":229}